[Openstack-stable-maint] Build failed in Jenkins: periodic-ceilometer-python27-stable-grizzly #2
OpenStack Jenkins
jenkins at openstack.org
Wed Aug 7 06:10:40 UTC 2013
See <https://jenkins01.openstack.org/job/periodic-ceilometer-python27-stable-grizzly/2/>
------------------------------------------
[...truncated 6124 lines...]
File "<https://jenkins01.openstack.org/job/periodic-ceilometer-python27-stable-grizzly/ws/.tox/py27/local/lib/python2.7/site-packages/stevedore/enabled.py",> line 52, in _load_one_plugin
ep, invoke_on_load, invoke_args, invoke_kwds,
File "<https://jenkins01.openstack.org/job/periodic-ceilometer-python27-stable-grizzly/ws/.tox/py27/local/lib/python2.7/site-packages/stevedore/extension.py",> line 101, in _load_one_plugin
plugin = ep.load()
File "<https://jenkins01.openstack.org/job/periodic-ceilometer-python27-stable-grizzly/ws/.tox/py27/local/lib/python2.7/site-packages/pkg_resources.py",> line 2259, in load
if require: self.require(env, installer)
File "<https://jenkins01.openstack.org/job/periodic-ceilometer-python27-stable-grizzly/ws/.tox/py27/local/lib/python2.7/site-packages/pkg_resources.py",> line 2272, in require
working_set.resolve(self.dist.requires(self.extras),env,installer)))
File "<https://jenkins01.openstack.org/job/periodic-ceilometer-python27-stable-grizzly/ws/.tox/py27/local/lib/python2.7/site-packages/pkg_resources.py",> line 630, in resolve
raise VersionConflict(dist,req) # XXX put more info here
VersionConflict: (requests 1.2.3 (<https://jenkins01.openstack.org/job/periodic-ceilometer-python27-stable-grizzly/ws/.tox/py27/lib/python2.7/site-packages),> Requirement.parse('requests>=1.1,<1.2.3'))
stevedore.extension: DEBUG: found extension EntryPoint.parse('image = ceilometer.image.glance:ImagePollster')
stevedore.extension: ERROR: Could not load 'image': (requests 1.2.3 (<https://jenkins01.openstack.org/job/periodic-ceilometer-python27-stable-grizzly/ws/.tox/py27/lib/python2.7/site-packages),> Requirement.parse('requests>=1.1,<1.2.3'))
stevedore.extension: ERROR: (requests 1.2.3 (<https://jenkins01.openstack.org/job/periodic-ceilometer-python27-stable-grizzly/ws/.tox/py27/lib/python2.7/site-packages),> Requirement.parse('requests>=1.1,<1.2.3'))
Traceback (most recent call last):
File "<https://jenkins01.openstack.org/job/periodic-ceilometer-python27-stable-grizzly/ws/.tox/py27/local/lib/python2.7/site-packages/stevedore/extension.py",> line 89, in _load_plugins
invoke_kwds,
File "<https://jenkins01.openstack.org/job/periodic-ceilometer-python27-stable-grizzly/ws/.tox/py27/local/lib/python2.7/site-packages/stevedore/enabled.py",> line 52, in _load_one_plugin
ep, invoke_on_load, invoke_args, invoke_kwds,
File "<https://jenkins01.openstack.org/job/periodic-ceilometer-python27-stable-grizzly/ws/.tox/py27/local/lib/python2.7/site-packages/stevedore/extension.py",> line 101, in _load_one_plugin
plugin = ep.load()
File "<https://jenkins01.openstack.org/job/periodic-ceilometer-python27-stable-grizzly/ws/.tox/py27/local/lib/python2.7/site-packages/pkg_resources.py",> line 2259, in load
if require: self.require(env, installer)
File "<https://jenkins01.openstack.org/job/periodic-ceilometer-python27-stable-grizzly/ws/.tox/py27/local/lib/python2.7/site-packages/pkg_resources.py",> line 2272, in require
working_set.resolve(self.dist.requires(self.extras),env,installer)))
File "<https://jenkins01.openstack.org/job/periodic-ceilometer-python27-stable-grizzly/ws/.tox/py27/local/lib/python2.7/site-packages/pkg_resources.py",> line 630, in resolve
raise VersionConflict(dist,req) # XXX put more info here
VersionConflict: (requests 1.2.3 (<https://jenkins01.openstack.org/job/periodic-ceilometer-python27-stable-grizzly/ws/.tox/py27/lib/python2.7/site-packages),> Requirement.parse('requests>=1.1,<1.2.3'))
stevedore.extension: DEBUG: found extension EntryPoint.parse('kwapi = ceilometer.energy.kwapi:KwapiPollster')
stevedore.extension: ERROR: Could not load 'kwapi': (requests 1.2.3 (<https://jenkins01.openstack.org/job/periodic-ceilometer-python27-stable-grizzly/ws/.tox/py27/lib/python2.7/site-packages),> Requirement.parse('requests>=1.1,<1.2.3'))
stevedore.extension: ERROR: (requests 1.2.3 (<https://jenkins01.openstack.org/job/periodic-ceilometer-python27-stable-grizzly/ws/.tox/py27/lib/python2.7/site-packages),> Requirement.parse('requests>=1.1,<1.2.3'))
Traceback (most recent call last):
File "<https://jenkins01.openstack.org/job/periodic-ceilometer-python27-stable-grizzly/ws/.tox/py27/local/lib/python2.7/site-packages/stevedore/extension.py",> line 89, in _load_plugins
invoke_kwds,
File "<https://jenkins01.openstack.org/job/periodic-ceilometer-python27-stable-grizzly/ws/.tox/py27/local/lib/python2.7/site-packages/stevedore/enabled.py",> line 52, in _load_one_plugin
ep, invoke_on_load, invoke_args, invoke_kwds,
File "<https://jenkins01.openstack.org/job/periodic-ceilometer-python27-stable-grizzly/ws/.tox/py27/local/lib/python2.7/site-packages/stevedore/extension.py",> line 101, in _load_one_plugin
plugin = ep.load()
File "<https://jenkins01.openstack.org/job/periodic-ceilometer-python27-stable-grizzly/ws/.tox/py27/local/lib/python2.7/site-packages/pkg_resources.py",> line 2259, in load
if require: self.require(env, installer)
File "<https://jenkins01.openstack.org/job/periodic-ceilometer-python27-stable-grizzly/ws/.tox/py27/local/lib/python2.7/site-packages/pkg_resources.py",> line 2272, in require
working_set.resolve(self.dist.requires(self.extras),env,installer)))
File "<https://jenkins01.openstack.org/job/periodic-ceilometer-python27-stable-grizzly/ws/.tox/py27/local/lib/python2.7/site-packages/pkg_resources.py",> line 630, in resolve
raise VersionConflict(dist,req) # XXX put more info here
VersionConflict: (requests 1.2.3 (<https://jenkins01.openstack.org/job/periodic-ceilometer-python27-stable-grizzly/ws/.tox/py27/lib/python2.7/site-packages),> Requirement.parse('requests>=1.1,<1.2.3'))
stevedore.extension: DEBUG: found extension EntryPoint.parse('meter_publisher = ceilometer.publisher.meter_publish:MeterPublisher')
stevedore.extension: ERROR: Could not load 'meter_publisher': (requests 1.2.3 (<https://jenkins01.openstack.org/job/periodic-ceilometer-python27-stable-grizzly/ws/.tox/py27/lib/python2.7/site-packages),> Requirement.parse('requests>=1.1,<1.2.3'))
stevedore.extension: ERROR: (requests 1.2.3 (<https://jenkins01.openstack.org/job/periodic-ceilometer-python27-stable-grizzly/ws/.tox/py27/lib/python2.7/site-packages),> Requirement.parse('requests>=1.1,<1.2.3'))
Traceback (most recent call last):
File "<https://jenkins01.openstack.org/job/periodic-ceilometer-python27-stable-grizzly/ws/.tox/py27/local/lib/python2.7/site-packages/stevedore/extension.py",> line 89, in _load_plugins
invoke_kwds,
File "<https://jenkins01.openstack.org/job/periodic-ceilometer-python27-stable-grizzly/ws/.tox/py27/local/lib/python2.7/site-packages/stevedore/enabled.py",> line 52, in _load_one_plugin
ep, invoke_on_load, invoke_args, invoke_kwds,
File "<https://jenkins01.openstack.org/job/periodic-ceilometer-python27-stable-grizzly/ws/.tox/py27/local/lib/python2.7/site-packages/stevedore/extension.py",> line 101, in _load_one_plugin
plugin = ep.load()
File "<https://jenkins01.openstack.org/job/periodic-ceilometer-python27-stable-grizzly/ws/.tox/py27/local/lib/python2.7/site-packages/pkg_resources.py",> line 2259, in load
if require: self.require(env, installer)
File "<https://jenkins01.openstack.org/job/periodic-ceilometer-python27-stable-grizzly/ws/.tox/py27/local/lib/python2.7/site-packages/pkg_resources.py",> line 2272, in require
working_set.resolve(self.dist.requires(self.extras),env,installer)))
File "<https://jenkins01.openstack.org/job/periodic-ceilometer-python27-stable-grizzly/ws/.tox/py27/local/lib/python2.7/site-packages/pkg_resources.py",> line 630, in resolve
raise VersionConflict(dist,req) # XXX put more info here
VersionConflict: (requests 1.2.3 (<https://jenkins01.openstack.org/job/periodic-ceilometer-python27-stable-grizzly/ws/.tox/py27/lib/python2.7/site-packages),> Requirement.parse('requests>=1.1,<1.2.3'))
--------------------- >> end captured logging << ---------------------
======================================================================
FAIL: test_v1 (tests.test_bin.BinApiTestCase)
----------------------------------------------------------------------
Traceback (most recent call last):
File "<https://jenkins01.openstack.org/job/periodic-ceilometer-python27-stable-grizzly/ws/tests/test_bin.py",> line 106, in test_v1
response, content = self.get_response('v1/meters')
File "<https://jenkins01.openstack.org/job/periodic-ceilometer-python27-stable-grizzly/ws/tests/test_bin.py",> line 101, in get_response
self.assertEqual(self.subp.poll(), None)
AssertionError: 1 != None
'1 != None' = '%s != %s' % (safe_repr(1), safe_repr(None))
'1 != None' = self._formatMessage('1 != None', '1 != None')
>> raise self.failureException('1 != None')
======================================================================
FAIL: test_v2 (tests.test_bin.BinApiTestCase)
----------------------------------------------------------------------
Traceback (most recent call last):
File "<https://jenkins01.openstack.org/job/periodic-ceilometer-python27-stable-grizzly/ws/tests/test_bin.py",> line 111, in test_v2
response, content = self.get_response('v2/meters')
File "<https://jenkins01.openstack.org/job/periodic-ceilometer-python27-stable-grizzly/ws/tests/test_bin.py",> line 101, in get_response
self.assertEqual(self.subp.poll(), None)
AssertionError: 1 != None
'1 != None' = '%s != %s' % (safe_repr(1), safe_repr(None))
'1 != None' = self._formatMessage('1 != None', '1 != None')
>> raise self.failureException('1 != None')
======================================================================
FAIL: test_dbsync_run (tests.test_bin.BinDbsyncTestCase)
----------------------------------------------------------------------
Traceback (most recent call last):
File "<https://jenkins01.openstack.org/job/periodic-ceilometer-python27-stable-grizzly/ws/tests/test_bin.py",> line 41, in test_dbsync_run
self.assertEqual(subp.wait(), 0)
AssertionError: 1 != 0
'1 != 0' = '%s != %s' % (safe_repr(1), safe_repr(0))
'1 != 0' = self._formatMessage('1 != 0', '1 != 0')
>> raise self.failureException('1 != 0')
======================================================================
FAIL: test_send_counter_run (tests.test_bin.BinSendCounterTestCase)
----------------------------------------------------------------------
Traceback (most recent call last):
File "<https://jenkins01.openstack.org/job/periodic-ceilometer-python27-stable-grizzly/ws/tests/test_bin.py",> line 62, in test_send_counter_run
self.assertEqual(subp.wait(), 0)
AssertionError: 1 != 0
'1 != 0' = '%s != %s' % (safe_repr(1), safe_repr(0))
'1 != 0' = self._formatMessage('1 != 0', '1 != 0')
>> raise self.failureException('1 != 0')
----------------------------------------------------------------------
XML: nosetests.xml
----------------------------------------------------------------------
Ran 397 tests in 11.727s
FAILED (SKIP=66, errors=30, failures=5)
ERROR: InvocationError: '<https://jenkins01.openstack.org/job/periodic-ceilometer-python27-stable-grizzly/ws/.tox/py27/bin/nosetests> --no-path-adjustment'
___________________________________ summary ____________________________________
ERROR: py27: commands failed
+ result=1
+ echo 'Begin pip freeze output from test virtualenv:'
Begin pip freeze output from test virtualenv:
+ echo ======================================================================
======================================================================
+ .tox/py27/bin/pip freeze
Babel==1.3
Cheetah==2.4.4
Flask==0.9
Jinja2==2.7
Mako==0.8.1
Markdown==2.3.1
MarkupSafe==0.18
Paste==1.7.5.1
PasteDeploy==1.5.0
PyYAML==3.10
Pygments==1.6
Routes==1.13
SQLAlchemy==0.7.10
Sphinx==1.1.3
Tempita==0.5.1
WSME==0.5b2
WebOb==1.2.3
WebTest==2.0.6
Werkzeug==0.9.3
amqp==1.0.13
amqplib==1.0.2
anyjson==0.3.3
argparse==1.2.1
beautifulsoup4==4.2.1
boto==2.9.9
ceilometer==jenkins.periodic.ceilometer.python27.stable.grizzly.2
cffi==0.7.2
cliff==1.4
cmd2==0.6.6
coverage==3.6
d2to1==0.2.10
decorator==3.4.0
dnspython==1.11.0
docutils==0.9.1
eventlet==0.13.0
extras==0.0.3
glance==2013.1
greenlet==0.4.1
happybase==0.6
httplib2==0.8
iso8601==0.1.4
jsonpatch==1.1
jsonpointer==1.0
jsonschema==2.0.0
kombu==2.5.12
lxml==3.2.3
mock==1.0.1
mox==0.5.3
netaddr==0.7.10
netifaces==0.8
nose==1.3.0
nova==2013.1
numpy==1.7.1
oslo.config==1.1.1
paramiko==1.11.0
passlib==1.6.1
pbr==0.5.21
pecan==0.3.1
prettytable==0.7.2
pyOpenSSL==0.13
pyasn1==0.1.7
pycparser==2.10
pycrypto==2.6
pymongo==2.5.2
pyparsing==1.5.7
python-cinderclient==1.0.5
python-glanceclient==0.9.0
python-keystoneclient==0.3.1
python-novaclient==2.14.0
python-quantumclient==2.2.3
python-spidermonkey==0.0.10
python-swiftclient==1.5.0
pytz==2013b
repoze.lru==0.6
requests==1.2.3
setuptools-git==1.0
simplegeneric==0.8.1
simplejson==3.3.0
six==1.3.0
sqlalchemy-migrate==0.7.2
stevedore==0.10
suds==0.4
swift==1.9.0
thrift==0.9.0
unittest2==0.5.1
waitress==0.8.5
warlock==1.0.1
websockify==0.3.0
wsgiref==0.1.2
xattr==0.7.2
+ echo ======================================================================
======================================================================
+ '[' -d .testrepository ']'
+ sudo /usr/local/jenkins/slave_scripts/jenkins-sudo-grep.sh post
+ sudoresult=0
+ '[' 0 -ne 0 ']'
+ /usr/local/jenkins/slave_scripts/jenkins-oom-grep.sh post
+ oomresult=0
+ '[' 0 -ne 0 ']'
++ find . -name nose_results.html
+ htmlreport=
+ '[' -f '' ']'
+ echo
+ echo 'WARNING: Unable to find to confirm results!'
WARNING: Unable to find to confirm results!
+ echo
+ exit 1
+ rm -rf /tmp/tmp.UrWbvk49LI
Build step 'Execute shell' marked build as failure
[SCP] Connecting to static.openstack.org
[SCP] No file(s) found: **/*nose_results.html
[SCP] '**/*nose_results.html' doesn't match anything: '**' exists but not '**/*nose_results.html'
[SCP] Connecting to static.openstack.org
[SCP] Trying to create /srv/static/logs/periodic/periodic-ceilometer-python27-stable-grizzly/precise7
[SCP] Trying to create /srv/static/logs/periodic/periodic-ceilometer-python27-stable-grizzly/precise7/2
[SCP] Copying console log.
More information about the Openstack-stable-maint
mailing list