Stable check of openstack/patrole for ref refs/heads/master failed
10 Mar
2022
10 Mar
'22
11:20 a.m.
Build failed. - patrole-member-wallaby https://zuul.opendev.org/t/openstack/build/9ecf820e676946ba9e91268947f78260 : FAILURE in 1h 00m 01s - patrole-member-victoria https://zuul.opendev.org/t/openstack/build/072c37f5ad7c43edab7947bba7d953b2 : FAILURE in 55m 18s - patrole-member-ussuri https://zuul.opendev.org/t/openstack/build/1a8cad5518d147c68db2f6cd9af770f6 : FAILURE in 54m 02s
1086
Age (days ago)
1086
Last active (days ago)
0 comments
1 participants
participants (1)
-
A mailing list for the OpenStack Stable Branch test reports.