Stable check of openstack/trove for ref refs/heads/stable/train failed
17 Apr
2022
17 Apr
'22
8:23 a.m.
Build failed. - openstack-tox-docs https://zuul.opendev.org/t/openstack/build/2ce8968aa8504ed9879cc497a4bcaac1 : FAILURE in 5m 26s - openstack-tox-py27 https://zuul.opendev.org/t/openstack/build/73c8bec0f6ac486bb67d523f25231fa0 : FAILURE in 4m 57s - openstack-tox-py36 https://zuul.opendev.org/t/openstack/build/cbffb7b282474ad6a0469a495cc8cee3 : FAILURE in 5m 10s - openstack-tox-py37 https://zuul.opendev.org/t/openstack/build/378cfdda096040c1a9c09b2026cdd6b8 : FAILURE in 4m 56s
1046
Age (days ago)
1046
Last active (days ago)
0 comments
1 participants
participants (1)
-
A mailing list for the OpenStack Stable Branch test reports.