Stable check of openstack/patrole for ref refs/heads/master failed
22 Sep
2022
22 Sep
'22
11:21 a.m.
Build failed. https://zuul.opendev.org/t/openstack/buildset/2b5a4f807b7547838298335eccdf47... - patrole-member-wallaby https://zuul.opendev.org/t/openstack/build/525ba6b06c0043f5b466f7b3f2d81e31 : FAILURE in 40m 30s - patrole-member-victoria https://zuul.opendev.org/t/openstack/build/e78009d641f04ab2abe82d6593410f5e : FAILURE in 57m 25s - patrole-member-ussuri https://zuul.opendev.org/t/openstack/build/f7e5f89aaf494c97a8ab6966f4e86f70 : FAILURE in 1h 10m 46s
890
Age (days ago)
890
Last active (days ago)
0 comments
1 participants
participants (1)
-
A mailing list for the OpenStack Stable Branch test reports.