Stable check of openstack/patrole for ref refs/heads/master failed
21 Sep
2022
21 Sep
'22
11:21 a.m.
Build failed. https://zuul.opendev.org/t/openstack/buildset/7f5ded368f4949d986b49fd246c519... - patrole-member-wallaby https://zuul.opendev.org/t/openstack/build/1b5605b5c8a34afea1111af326901e18 : FAILURE in 38m 54s - patrole-member-victoria https://zuul.opendev.org/t/openstack/build/7352a5e39bdf4e9c8dcdde6207afd494 : FAILURE in 1h 06m 27s - patrole-member-ussuri https://zuul.opendev.org/t/openstack/build/cc450c2fc6f74537ba15a4acc22a8325 : FAILURE in 1h 03m 11s
891
Age (days ago)
891
Last active (days ago)
0 comments
1 participants
participants (1)
-
A mailing list for the OpenStack Stable Branch test reports.