Stable check of openstack/neutron for ref refs/heads/stable/train failed
14 Dec
2019
14 Dec
'19
9:50 a.m.
Build failed. - openstack-tox-docs https://zuul.opendev.org/t/openstack/build/d8352729899d4b728c630841febd14b4 : SUCCESS in 11m 07s - openstack-tox-py27 https://zuul.opendev.org/t/openstack/build/c0b07c96fe0e4cbd8909538631b6556b : FAILURE in 6m 16s - openstack-tox-py36 https://zuul.opendev.org/t/openstack/build/d4d3949e866c4145afbc5fd49a4a5ada : FAILURE in 5m 48s - openstack-tox-py37 https://zuul.opendev.org/t/openstack/build/6a3af87ae4dd496587f26b3a55b0198e : FAILURE in 6m 54s
2491
Age (days ago)
2491
Last active (days ago)
0 comments
1 participants
participants (1)
-
A mailing list for the OpenStack Stable Branch test reports.