Stable check of openstack/patrole for ref refs/heads/master failed
8 Mar
2022
8 Mar
'22
8:44 a.m.
Build failed. - patrole-member-wallaby https://zuul.opendev.org/t/openstack/build/f9b55165e8bf4799b736e97cf0be3384 : FAILURE in 1h 05m 15s - patrole-member-victoria https://zuul.opendev.org/t/openstack/build/2c3e82afc2e148b0abe9b3b4cbffa6cd : FAILURE in 1h 02m 36s - patrole-member-ussuri https://zuul.opendev.org/t/openstack/build/b916683ec43840f4bffcfd04215b8c20 : FAILURE in 59m 46s
1086
Age (days ago)
1086
Last active (days ago)
0 comments
1 participants
participants (1)
-
A mailing list for the OpenStack Stable Branch test reports.