Stable check of openstack/murano for ref refs/heads/stable/train failed
27 Jul
2020
27 Jul
'20
3:59 p.m.
Build failed. - openstack-tox-docs https://zuul.opendev.org/t/openstack/build/50a3665fd2a24b94933b436058ce9a96 : SUCCESS in 13m 07s - openstack-tox-py27 https://zuul.opendev.org/t/openstack/build/77fc46aeb7e24c639bf5134eceee7989 : FAILURE in 9m 07s - openstack-tox-py36 https://zuul.opendev.org/t/openstack/build/4b9c08471eb14262b293f08a3ea8a112 : FAILURE in 8m 06s - openstack-tox-py37 https://zuul.opendev.org/t/openstack/build/06535096dc9547e481d135ffe7f92023 : FAILURE in 11m 41s
1951
Age (days ago)
1951
Last active (days ago)
0 comments
1 participants
participants (1)
-
A mailing list for the OpenStack Stable Branch test reports.