Stable check of openstack/zaqar for ref refs/heads/stable/2024.2 failed
29 Apr
2026
29 Apr
'26
8:05 p.m.
Build failed. https://zuul.opendev.org/t/openstack/buildset/3d60cca23d534f25b024466bc79f2a... - openstack-tox-docs https://zuul.opendev.org/t/openstack/build/69ce71cbeb5e4b39a12edcfc5c27b28c : FAILURE in 3m 52s - openstack-tox-py39 https://zuul.opendev.org/t/openstack/build/94d81e5005084741986f1234f35c1144 : FAILURE in 8m 13s - openstack-tox-py311 https://zuul.opendev.org/t/openstack/build/9b685d38ddf7482b976d8794da1b0a18 : FAILURE in 8m 24s
167
Age (days ago)
167
Last active (days ago)
0 comments
1 participants
participants (1)
-
A mailing list for the OpenStack Stable Branch test reports.