Stable check of openstack/tooz for ref refs/heads/stable/train failed
10 Mar
2022
10 Mar
'22
10:57 a.m.
Build failed. - openstack-tox-docs https://zuul.opendev.org/t/openstack/build/72835dfe748f4985abe5cd9f7c2318bb : SUCCESS in 7m 39s - openstack-tox-py27 https://zuul.opendev.org/t/openstack/build/99dbfcc289234122841e159d95919375 : FAILURE in 7m 23s - openstack-tox-py36 https://zuul.opendev.org/t/openstack/build/a0143046c3cd439e91aac81f2d2a77af : FAILURE in 8m 31s - openstack-tox-py37 https://zuul.opendev.org/t/openstack/build/20524b1b042444c9bae8c5921526ff4d : FAILURE in 7m 43s
1085
Age (days ago)
1085
Last active (days ago)
0 comments
1 participants
participants (1)
-
A mailing list for the OpenStack Stable Branch test reports.