Stable check of openstack/tooz for ref refs/heads/stable/train failed
26 Jun
2021
26 Jun
'21
11:45 p.m.
Build failed. - openstack-tox-docs https://zuul.opendev.org/t/openstack/build/9c743213881b4c1cae0020aab3a21a86 : SUCCESS in 9m 01s - openstack-tox-py27 https://zuul.opendev.org/t/openstack/build/a688931583734088a5ec9111125058d2 : FAILURE in 7m 30s - openstack-tox-py36 https://zuul.opendev.org/t/openstack/build/7655b329c34d4d888b1cccab850ab47d : FAILURE in 7m 33s - openstack-tox-py37 https://zuul.opendev.org/t/openstack/build/df5121c49bb04a41a8935aaa9ea3be0e : FAILURE in 7m 50s
1325
Age (days ago)
1325
Last active (days ago)
0 comments
1 participants
participants (1)
-
A mailing list for the OpenStack Stable Branch test reports.