Stable check of openstack/patrole for ref refs/heads/master failed
17 Sep
2022
17 Sep
'22
8:45 a.m.
Build failed. https://zuul.opendev.org/t/openstack/buildset/56e49de068f34bc9892862060b3e83... - patrole-member-wallaby https://zuul.opendev.org/t/openstack/build/76a59075a1bf47a0b339a6a5629bedf4 : FAILURE in 34m 38s - patrole-member-victoria https://zuul.opendev.org/t/openstack/build/9adb7a0223084bc9a91203906a5063a3 : FAILURE in 55m 53s - patrole-member-ussuri https://zuul.opendev.org/t/openstack/build/a3577ddc24824179a54311061335407f : FAILURE in 58m 35s
893
Age (days ago)
893
Last active (days ago)
0 comments
1 participants
participants (1)
-
A mailing list for the OpenStack Stable Branch test reports.