Stable check of openstack/kolla for ref refs/heads/stable/2024.2 failed
Build failed. https://zuul.opendev.org/t/openstack/buildset/d5f6619985ee4fd9ba5474a97d96f9... - kolla-publish-debian-quay https://zuul.opendev.org/t/openstack/build/84d0a57bf946487ca09f4873df147585 : POST_FAILURE in 48m 59s - kolla-publish-debian-aarch64-quay https://zuul.opendev.org/t/openstack/build/dd911a7e9fcc42c399d5e697f7551530 : POST_FAILURE in 1h 59m 35s (non-voting) - openstack-tox-docs https://zuul.opendev.org/t/openstack/build/223bab11d97f4c5da34dc4b7b72ec694 : FAILURE in 4m 42s - openstack-tox-py39 https://zuul.opendev.org/t/openstack/build/36f8187467484a52be1d7630a900eaa8 : FAILURE in 3m 37s - openstack-tox-py311 https://zuul.opendev.org/t/openstack/build/dae9439fa33449aba827aee2ee021632 : FAILURE in 4m 32s - kolla-publish-rocky9-quay https://zuul.opendev.org/t/openstack/build/a4584cc128a1416abacda3e9ee07d651 : POST_FAILURE in 1h 07m 38s - kolla-publish-ubuntu-quay https://zuul.opendev.org/t/openstack/build/682b9d37d13b47cdb39632c8202a2542 : POST_FAILURE in 59m 40s
participants (1)
-
A mailing list for the OpenStack Stable Branch test reports.