Stable check of openstack/tooz for ref refs/heads/stable/train failed
9 Mar
2022
9 Mar
'22
10:59 a.m.
Build failed. - openstack-tox-docs https://zuul.opendev.org/t/openstack/build/7dc2502d05a844dd8ce50006a3023ccc : SUCCESS in 9m 59s - openstack-tox-py27 https://zuul.opendev.org/t/openstack/build/789adb75d4c24a7682b0ab38f9af000a : FAILURE in 7m 20s - openstack-tox-py36 https://zuul.opendev.org/t/openstack/build/a7b6178425284cc883311ab33432cfaa : FAILURE in 7m 56s - openstack-tox-py37 https://zuul.opendev.org/t/openstack/build/7e515d44a2cc4807927b398d5ead4118 : FAILURE in 9m 57s
1086
Age (days ago)
1086
Last active (days ago)
0 comments
1 participants
participants (1)
-
A mailing list for the OpenStack Stable Branch test reports.