Stable check of openstack/patrole for ref refs/heads/master failed
9 Mar
2022
9 Mar
'22
11:20 a.m.
Build failed. - patrole-member-wallaby https://zuul.opendev.org/t/openstack/build/47e3222586c645b8a55674b2195463e8 : FAILURE in 53m 56s - patrole-member-victoria https://zuul.opendev.org/t/openstack/build/b9f0ba13681f447bbad350ddb9dff5c2 : FAILURE in 58m 52s - patrole-member-ussuri https://zuul.opendev.org/t/openstack/build/841f76ba35f446549af7ebd838687589 : FAILURE in 56m 29s
1086
Age (days ago)
1086
Last active (days ago)
0 comments
1 participants
participants (1)
-
A mailing list for the OpenStack Stable Branch test reports.