16 Apr
2022
16 Apr
'22
10:39 p.m.
Build failed. - openstack-tox-docs https://zuul.opendev.org/t/openstack/build/8854e71871d641d9866929612fd12b70 : SUCCESS in 4m 50s - openstack-tox-py27 https://zuul.opendev.org/t/openstack/build/2dc021cdb60a4991918c5b9c4a670eb7 : FAILURE in 6m 46s - openstack-tox-py36 https://zuul.opendev.org/t/openstack/build/b110ce85f0704479aa598dc9a5d5f530 : FAILURE in 4m 18s - openstack-tox-py37 https://zuul.opendev.org/t/openstack/build/707ec299e46f4525869d9bcfb194cb20 : FAILURE in 4m 32s