7 Mar
2022
7 Mar
'22
10:06 p.m.
Build failed. - openstack-tox-docs https://zuul.opendev.org/t/openstack/build/4f5b4758f00c41f8ac7b1070cd5ce48b : FAILURE in 9m 22s - openstack-tox-py27 https://zuul.opendev.org/t/openstack/build/c5862c8170d14ce9b136d88b26c0e7d0 : FAILURE in 8m 18s - openstack-tox-py36 https://zuul.opendev.org/t/openstack/build/2dc9c843866145b6b5a0f4ee8cd11e2b : FAILURE in 8m 20s - openstack-tox-py37 https://zuul.opendev.org/t/openstack/build/c370241f7d9e400d9a4498b3fb532a62 : FAILURE in 8m 26s