20 Feb
2022
20 Feb
'22
3:23 a.m.
Build failed. - openstack-tox-docs https://zuul.opendev.org/t/openstack/build/5e007248ed534e909ff31be0ed839f6f : SUCCESS in 7m 43s - openstack-tox-py27 https://zuul.opendev.org/t/openstack/build/2966f8885c774b08b1704e18a2de204f : FAILURE in 7m 52s - openstack-tox-py36 https://zuul.opendev.org/t/openstack/build/0be6f7af8364497baf3b986b02083ec4 : FAILURE in 7m 39s - openstack-tox-py37 https://zuul.opendev.org/t/openstack/build/cad37b3277db40b5894145a7e90832d3 : FAILURE in 8m 11s