9 Mar
2022
9 Mar
'22
10:39 a.m.
Build failed. - openstack-tox-docs https://zuul.opendev.org/t/openstack/build/08104cd749e946db95f1fea8feadb43b : SUCCESS in 10m 20s - openstack-tox-py27 https://zuul.opendev.org/t/openstack/build/a4bf3cecf96d409a812e67b84bcf597f : FAILURE in 9m 12s - openstack-tox-py36 https://zuul.opendev.org/t/openstack/build/e3cf81d9d82247adb70ac4058eaba8a9 : FAILURE in 8m 34s - openstack-tox-py37 https://zuul.opendev.org/t/openstack/build/c6ea00f0d6c94dc1a09e763e20bc863b : FAILURE in 8m 33s