7 Mar
2022
7 Mar
'22
7:03 p.m.
Build failed. - openstack-tox-docs https://zuul.opendev.org/t/openstack/build/0ed22e72d72c4a048c2b2a4aad5af2f4 : SUCCESS in 7m 48s - openstack-tox-py27 https://zuul.opendev.org/t/openstack/build/b9f0bf2fb2024c6184dbe38b72feca9a : FAILURE in 10m 30s - openstack-tox-py36 https://zuul.opendev.org/t/openstack/build/bfe3a1bbb79e434fa67b7a0a62e75739 : FAILURE in 8m 34s - openstack-tox-py37 https://zuul.opendev.org/t/openstack/build/2e07d4fd1db242b584c306aa765672c7 : FAILURE in 8m 37s