17 Sep
2022
17 Sep
'22
10:17 p.m.
Build failed. https://zuul.opendev.org/t/openstack/buildset/0cb7329344df4376b52dbdb2e423e0... - patrole-member-wallaby https://zuul.opendev.org/t/openstack/build/11300a3cce954b688f777ab50c5ffbab : FAILURE in 46m 23s - patrole-member-victoria https://zuul.opendev.org/t/openstack/build/ba206ffb65f6494a821a49dc3380cf3d : FAILURE in 1h 05m 51s - patrole-member-ussuri https://zuul.opendev.org/t/openstack/build/a48ac8bb2dcb41c3a1512e65739b473a : FAILURE in 55m 14s