19 Sep
2022
19 Sep
'22
11:09 a.m.
Build failed. https://zuul.opendev.org/t/openstack/buildset/f9697d13000b4a64b726b0bf0d67f4... - patrole-member-wallaby https://zuul.opendev.org/t/openstack/build/cc225d7b5c414149800dad2805ea843d : FAILURE in 35m 10s - patrole-member-victoria https://zuul.opendev.org/t/openstack/build/1b13b1e46c3d46ffa9086d1aba183916 : FAILURE in 55m 05s - patrole-member-ussuri https://zuul.opendev.org/t/openstack/build/249abcf5b1004e63b7ef62ff0c9d7997 : FAILURE in 1h 02m 13s