15 Apr
2022
15 Apr
'22
11:02 a.m.
Build failed. - openstack-tox-docs https://zuul.opendev.org/t/openstack/build/db0de93eddea47a895eb751d5147a44a : SUCCESS in 7m 01s - openstack-tox-py27 https://zuul.opendev.org/t/openstack/build/e7a1055337b9461d9d21448f3f56e169 : FAILURE in 6m 02s - openstack-tox-py36 https://zuul.opendev.org/t/openstack/build/b29ad1cd1f74452ab0246d95607d23b7 : FAILURE in 5m 47s - openstack-tox-py37 https://zuul.opendev.org/t/openstack/build/e3900049d44e472b81158d99924da910 : FAILURE in 8m 01s