Build failed. - build-openstack-sphinx-docs http://logs.openstack.org/periodic-stable/git.openstack.org/openstack/kolla/... : SUCCESS in 4m 16s - openstack-tox-py27 http://logs.openstack.org/periodic-stable/git.openstack.org/openstack/kolla/... : SUCCESS in 4m 49s - kolla-publish-centos-source http://logs.openstack.org/periodic-stable/git.openstack.org/openstack/kolla/... : FAILURE in 10m 39s - kolla-publish-centos-binary http://logs.openstack.org/periodic-stable/git.openstack.org/openstack/kolla/... : FAILURE in 7m 19s (non-voting) - kolla-publish-ubuntu-source http://logs.openstack.org/periodic-stable/git.openstack.org/openstack/kolla/... : SUCCESS in 1h 10m 43s - kolla-publish-ubuntu-binary http://logs.openstack.org/periodic-stable/git.openstack.org/openstack/kolla/... : SUCCESS in 1h 17m 50s (non-voting) - kolla-publish-oraclelinux-source http://logs.openstack.org/periodic-stable/git.openstack.org/openstack/kolla/... : FAILURE in 9m 08s - kolla-publish-oraclelinux-binary http://logs.openstack.org/periodic-stable/git.openstack.org/openstack/kolla/... : FAILURE in 6m 42s (non-voting)