12 Mar
2022
12 Mar
'22
10:26 a.m.
Build failed. - openstack-tox-docs https://zuul.opendev.org/t/openstack/build/e2840ebbbb2c470ea527157f7d4b6764 : SUCCESS in 11m 21s - openstack-tox-py27 https://zuul.opendev.org/t/openstack/build/92489f56ae4c4027b59fb275c2151614 : FAILURE in 10m 41s - openstack-tox-py36 https://zuul.opendev.org/t/openstack/build/38c1b62bf87146bfa034f49720508161 : FAILURE in 9m 54s - openstack-tox-py37 https://zuul.opendev.org/t/openstack/build/8188bf45623947f4be6f99c3971f2ba9 : FAILURE in 10m 08s