14 Apr
2022
14 Apr
'22
10:57 a.m.
Build failed. - openstack-tox-docs https://zuul.opendev.org/t/openstack/build/f0fd710b8d2f490caed4d32db1858bf4 : SUCCESS in 6m 25s - openstack-tox-py27 https://zuul.opendev.org/t/openstack/build/54405cb4cff741d6b7be9d9289163c52 : FAILURE in 5m 31s - openstack-tox-py36 https://zuul.opendev.org/t/openstack/build/67e410b292a949ff8c102df9c12f7ae5 : FAILURE in 6m 58s - openstack-tox-py37 https://zuul.opendev.org/t/openstack/build/785e012d39c043fa8d6be16e1a77aee1 : FAILURE in 8m 09s