20 Sep
2022
20 Sep
'22
10:55 a.m.
Build failed. https://zuul.opendev.org/t/openstack/buildset/92078b4a973642e18c577803b0ba8a... - patrole-member-wallaby https://zuul.opendev.org/t/openstack/build/1e4df68da418475aaa2aa2514bc09b88 : FAILURE in 30m 57s - patrole-member-victoria https://zuul.opendev.org/t/openstack/build/91b28f9bdc044649b89bd559a08071d2 : FAILURE in 45m 15s - patrole-member-ussuri https://zuul.opendev.org/t/openstack/build/0e04a8b4e1a34b81b3e8a87d9fb34df0 : FAILURE in 41m 11s