20 Mar
2023
20 Mar
'23
8:42 a.m.
Build failed. https://zuul.opendev.org/t/openstack/buildset/87071249d1344453817a0cf148fb23... - patrole-member-wallaby https://zuul.opendev.org/t/openstack/build/644cf9a6945d44f6860ff8b585b034df : FAILURE in 35m 18s - patrole-member-victoria https://zuul.opendev.org/t/openstack/build/6f61dab941ea4846be30c1d6a16bcaad : FAILURE in 44m 22s - patrole-member-ussuri https://zuul.opendev.org/t/openstack/build/13dce45e562143609ae4cc4ba812085c : FAILURE in 55m 29s