11 Mar
2022
11 Mar
'22
11:29 a.m.
Build failed. - patrole-member-wallaby https://zuul.opendev.org/t/openstack/build/e78260cb016741cda62860ba110234dc : FAILURE in 57m 29s - patrole-member-victoria https://zuul.opendev.org/t/openstack/build/5d25f45ac65d473ea43bf5b6f3a80e7f : FAILURE in 59m 05s - patrole-member-ussuri https://zuul.opendev.org/t/openstack/build/95e377c0b41543338631b1bd0c28dc30 : FAILURE in 1h 01m 12s