Build failed. - build-openstack-sphinx-docs http://logs.openstack.org/periodic-stable/git.openstack.org/openstack/kolla/... : SUCCESS in 4m 10s - openstack-tox-py27 http://logs.openstack.org/periodic-stable/git.openstack.org/openstack/kolla/... : SUCCESS in 6m 10s - kolla-publish-centos-source http://logs.openstack.org/periodic-stable/git.openstack.org/openstack/kolla/... : FAILURE in 10m 33s - kolla-publish-centos-binary http://logs.openstack.org/periodic-stable/git.openstack.org/openstack/kolla/... : FAILURE in 10m 35s (non-voting) - kolla-publish-ubuntu-source http://logs.openstack.org/periodic-stable/git.openstack.org/openstack/kolla/... : SUCCESS in 1h 23m 58s - kolla-publish-ubuntu-binary http://logs.openstack.org/periodic-stable/git.openstack.org/openstack/kolla/... : SUCCESS in 1h 13m 57s (non-voting) - kolla-publish-oraclelinux-source http://logs.openstack.org/periodic-stable/git.openstack.org/openstack/kolla/... : FAILURE in 8m 58s - kolla-publish-oraclelinux-binary http://logs.openstack.org/periodic-stable/git.openstack.org/openstack/kolla/... : FAILURE in 8m 04s (non-voting)