15 Apr
2022
15 Apr
'22
11:15 a.m.
Build failed. - openstack-tox-docs https://zuul.opendev.org/t/openstack/build/21a297a2e28d4ec6bc4d96ffa6b8a427 : SUCCESS in 5m 15s - openstack-tox-py27 https://zuul.opendev.org/t/openstack/build/5d4e9351603b4102b993ff6852bc42d8 : FAILURE in 6m 45s - openstack-tox-py36 https://zuul.opendev.org/t/openstack/build/ac7d84aad9b44b2a957b725bed14f0e5 : FAILURE in 4m 22s - openstack-tox-py37 https://zuul.opendev.org/t/openstack/build/2dcccf367d8c4b2bb15306f4ff6c3b81 : FAILURE in 5m 15s