14 Apr
2022
14 Apr
'22
11:06 a.m.
Build failed. - openstack-tox-docs https://zuul.opendev.org/t/openstack/build/532d2c767beb4111af3780c10cfa2ad5 : SUCCESS in 4m 40s - openstack-tox-py27 https://zuul.opendev.org/t/openstack/build/fb318d3f58864c5bac589c55d678cb64 : FAILURE in 6m 33s - openstack-tox-py36 https://zuul.opendev.org/t/openstack/build/3cfe00a4e3f9492291296722373f0d89 : FAILURE in 3m 58s - openstack-tox-py37 https://zuul.opendev.org/t/openstack/build/1fb545789e0c4663afbfb036cf617254 : FAILURE in 3m 42s