15 Apr
2022
15 Apr
'22
11:30 a.m.
Build failed. - patrole-member-wallaby https://zuul.opendev.org/t/openstack/build/4a55f6a0b9624289a124bb42ad8d93be : FAILURE in 1h 06m 52s - patrole-member-victoria https://zuul.opendev.org/t/openstack/build/51a3a3289e9e4494917da69bbfd9c93c : FAILURE in 1h 00m 39s - patrole-member-ussuri https://zuul.opendev.org/t/openstack/build/08e6c292a2634ad28559f65bc548bd9e : FAILURE in 17m 21s