10 Mar
2022
10 Mar
'22
10:57 a.m.
Build failed. - openstack-tox-docs https://zuul.opendev.org/t/openstack/build/8f887be3c43f42e4a3267d201afac487 : SUCCESS in 6m 41s - openstack-tox-py27 https://zuul.opendev.org/t/openstack/build/e15db356133e42039e5ea1257fb2ea70 : FAILURE in 9m 44s - openstack-tox-py36 https://zuul.opendev.org/t/openstack/build/37dfc778f5ce49158dc43aa755946469 : FAILURE in 6m 52s - openstack-tox-py37 https://zuul.opendev.org/t/openstack/build/b60189201eba4b9d8f69c6b2fb225d72 : FAILURE in 7m 26s