8 Jan
2022
8 Jan
'22
11:31 a.m.
Build failed. - openstack-tox-docs https://zuul.opendev.org/t/openstack/build/001f403f07d44ec89c8e1d39a2baac50 : SUCCESS in 5m 08s - openstack-tox-py27 https://zuul.opendev.org/t/openstack/build/876810863b4b43938628d1f75bd92329 : FAILURE in 7m 26s - openstack-tox-py36 https://zuul.opendev.org/t/openstack/build/8fa6bb6dc6fd4590b3d76200b7a10120 : FAILURE in 7m 27s - openstack-tox-py37 https://zuul.opendev.org/t/openstack/build/41d880320c9941aca433fe7ac195fbd3 : FAILURE in 6m 09s