16 Apr
2022
16 Apr
'22
10:54 a.m.
Build failed. - openstack-tox-docs https://zuul.opendev.org/t/openstack/build/6a0ea90f52c74307b8d53079c28583c0 : FAILURE in 6m 11s - openstack-tox-py27 https://zuul.opendev.org/t/openstack/build/efb94241e3484e0db1a4c2f4adf22be4 : FAILURE in 5m 25s - openstack-tox-py36 https://zuul.opendev.org/t/openstack/build/c21615ce137c4095bf9628cb8384f810 : FAILURE in 6m 00s - openstack-tox-py37 https://zuul.opendev.org/t/openstack/build/d4e2cbf96476435d86e3ecbffa38b920 : FAILURE in 6m 47s