16 Apr
2022
16 Apr
'22
10:25 a.m.
Build failed. - openstack-tox-docs https://zuul.opendev.org/t/openstack/build/90cfa80b235b43628fd55049b3ea184b : SUCCESS in 9m 03s - openstack-tox-py27 https://zuul.opendev.org/t/openstack/build/e0438e42a2f4403798a559363b3534f4 : FAILURE in 7m 27s - openstack-tox-py36 https://zuul.opendev.org/t/openstack/build/e40b6e170429495fa64bdd275362000a : FAILURE in 8m 23s - openstack-tox-py37 https://zuul.opendev.org/t/openstack/build/24a0d636c85741928b2e7a8fe7160a04 : FAILURE in 7m 56s