7 Mar
2022
7 Mar
'22
10:08 p.m.
Build failed. - openstack-tox-docs https://zuul.opendev.org/t/openstack/build/f08aac834f2b46068de9fb6a4249b7c8 : SUCCESS in 10m 14s - openstack-tox-py27 https://zuul.opendev.org/t/openstack/build/df75921e29ba4e09bdeb7c22ef08fe70 : FAILURE in 9m 21s - openstack-tox-py36 https://zuul.opendev.org/t/openstack/build/0a110ae8111c4bd99f4afd66f5851d84 : FAILURE in 9m 58s - openstack-tox-py37 https://zuul.opendev.org/t/openstack/build/f0aaedd32d2f42e3acdd728f8e675860 : FAILURE in 11m 19s