25 Feb
2022
25 Feb
'22
8:01 a.m.
Build failed. - openstack-tox-docs https://zuul.opendev.org/t/openstack/build/5366fb2d19c8450faa3ad597d9f57e37 : FAILURE in 6m 43s - openstack-tox-py27 https://zuul.opendev.org/t/openstack/build/43edb6fcf64e48eabcf3a9e36d87aa77 : FAILURE in 5m 57s - openstack-tox-py36 https://zuul.opendev.org/t/openstack/build/a7498b76e96b42d0a5882875d56f4db6 : FAILURE in 5m 56s - openstack-tox-py37 https://zuul.opendev.org/t/openstack/build/00f570d01acf4473a9e90fbfd29f4859 : FAILURE in 6m 31s