10 Mar
2022
10 Mar
'22
10:57 a.m.
Build failed. - openstack-tox-docs https://zuul.opendev.org/t/openstack/build/81f0cb2556cc4a33806e8e00880e8169 : SUCCESS in 9m 37s - openstack-tox-py27 https://zuul.opendev.org/t/openstack/build/f0a71540682048ac9f18c921c839856f : FAILURE in 8m 07s - openstack-tox-py36 https://zuul.opendev.org/t/openstack/build/73d2edece7e64e4bbcfd9288feb60506 : FAILURE in 8m 16s - openstack-tox-py37 https://zuul.opendev.org/t/openstack/build/dd2b7770a69643e8a24806103f04ffb3 : FAILURE in 8m 33s