Openstack-stable-maint
Threads by month
- ----- 2025 -----
- May
- April
- March
- February
- January
- ----- 2024 -----
- December
- November
- October
- September
- August
- July
- June
- May
- April
- March
- February
- January
- ----- 2023 -----
- December
- November
- October
- September
- August
- July
- June
- May
- April
- March
- February
- January
- ----- 2022 -----
- December
- November
- October
- September
- August
- July
- June
- May
- April
- March
- February
- January
- ----- 2021 -----
- December
- November
- October
- September
- August
- July
- June
- May
- April
- March
- February
- January
- ----- 2020 -----
- December
- November
- October
- September
- August
- July
- June
- May
- April
- March
- February
- January
- ----- 2019 -----
- December
- November
- October
- September
- August
- July
- June
- May
- April
- March
- February
- January
- ----- 2018 -----
- December
- November
- October
- September
- August
- July
- June
- May
- April
- March
- February
- January
- ----- 2017 -----
- December
- November
- October
- September
- August
- July
- June
- May
- April
- March
- February
- January
- ----- 2016 -----
- December
- November
- October
- September
- August
- July
- June
- May
- April
- March
- February
- January
- ----- 2015 -----
- December
- November
- October
- September
- August
- July
- June
- May
- April
- March
- February
- January
- ----- 2014 -----
- December
- November
- October
- September
- August
- July
- June
- May
- April
- March
- February
- January
- ----- 2013 -----
- December
- November
- October
- September
- August
- July
- June
- May
- April
- March
- February
- January
- ----- 2012 -----
- December
- November
August 2013
- 14 participants
- 73 discussions
Build failed in Jenkins: periodic-ceilometer-python26-stable-grizzly #4
by OpenStack Jenkins 17 Aug '13
by OpenStack Jenkins 17 Aug '13
17 Aug '13
See <https://jenkins01.openstack.org/job/periodic-ceilometer-python26-stable-gri…>
------------------------------------------
[...truncated 187 lines...]
Processing d2to1-0.2.10.tar.gz
Writing /tmp/tmp.h5Ilk60TdJ/easy_install-EaWhPo/d2to1-0.2.10/setup.cfg
Running d2to1-0.2.10/setup.py -q bdist_egg --dist-dir /tmp/tmp.h5Ilk60TdJ/easy_install-EaWhPo/d2to1-0.2.10/egg-dist-tmp-pZwg6Y
Installed <https://jenkins01.openstack.org/job/periodic-ceilometer-python26-stable-gri…>
[pbr] Processing SOURCES.txt
warning: LocalManifestMaker: standard file '-c' not found
[pbr] In git context, generating filelist from git
warning: no previously-included files matching '*.pyc' found anywhere in distribution
warning: no previously-included files found matching '.gitignore'
warning: no previously-included files found matching '.gitreview'
Error in atexit._run_exitfuncs:
Traceback (most recent call last):
File "/usr/lib64/python2.6/atexit.py", line 24, in _run_exitfuncs
func(*targs, **kargs)
File "/usr/lib64/python2.6/multiprocessing/util.py", line 258, in _exit_function
info('process shutting down')
TypeError: 'NoneType' object is not callable
Error in atexit._run_exitfuncs:
Traceback (most recent call last):
File "/usr/lib64/python2.6/atexit.py", line 24, in _run_exitfuncs
func(*targs, **kargs)
File "/usr/lib64/python2.6/multiprocessing/util.py", line 258, in _exit_function
info('process shutting down')
TypeError: 'NoneType' object is not callable
Error in sys.exitfunc:
Traceback (most recent call last):
File "/usr/lib64/python2.6/atexit.py", line 24, in _run_exitfuncs
func(*targs, **kargs)
File "/usr/lib64/python2.6/multiprocessing/util.py", line 258, in _exit_function
info('process shutting down')
TypeError: 'NoneType' object is not callable
Downloading/unpacking python-novaclient>=2.6.10 (from -r <https://jenkins01.openstack.org/job/periodic-ceilometer-python26-stable-gri…> (line 14))
Running setup.py egg_info for package python-novaclient
Installed <https://jenkins01.openstack.org/job/periodic-ceilometer-python26-stable-gri…>
[pbr] Processing SOURCES.txt
warning: LocalManifestMaker: standard file '-c' not found
[pbr] In git context, generating filelist from git
warning: no previously-included files matching '*.pyc' found anywhere in distribution
warning: no previously-included files found matching '.gitignore'
warning: no previously-included files found matching '.gitreview'
Error in atexit._run_exitfuncs:
Traceback (most recent call last):
File "/usr/lib64/python2.6/atexit.py", line 24, in _run_exitfuncs
func(*targs, **kargs)
File "/usr/lib64/python2.6/multiprocessing/util.py", line 258, in _exit_function
info('process shutting down')
TypeError: 'NoneType' object is not callable
Error in sys.exitfunc:
Traceback (most recent call last):
File "/usr/lib64/python2.6/atexit.py", line 24, in _run_exitfuncs
func(*targs, **kargs)
File "/usr/lib64/python2.6/multiprocessing/util.py", line 258, in _exit_function
info('process shutting down')
TypeError: 'NoneType' object is not callable
Downloading/unpacking python-keystoneclient>=0.2.3 (from -r <https://jenkins01.openstack.org/job/periodic-ceilometer-python26-stable-gri…> (line 15))
Running setup.py egg_info for package python-keystoneclient
Installed <https://jenkins01.openstack.org/job/periodic-ceilometer-python26-stable-gri…>
Searching for d2to1>=0.2.10,<0.3
Reading https://pypi.python.org/simple/d2to1/
Best match: d2to1 0.2.10
Downloading https://pypi.python.org/packages/source/d/d2to1/d2to1-0.2.10.tar.gz#md5=be9…
Processing d2to1-0.2.10.tar.gz
Writing /tmp/tmp.h5Ilk60TdJ/easy_install-_Elm6_/d2to1-0.2.10/setup.cfg
Running d2to1-0.2.10/setup.py -q bdist_egg --dist-dir /tmp/tmp.h5Ilk60TdJ/easy_install-_Elm6_/d2to1-0.2.10/egg-dist-tmp-_12PNL
Installed <https://jenkins01.openstack.org/job/periodic-ceilometer-python26-stable-gri…>
[pbr] Processing SOURCES.txt
warning: LocalManifestMaker: standard file '-c' not found
[pbr] In git context, generating filelist from git
warning: no previously-included files matching '*.pyc' found anywhere in distribution
Error in atexit._run_exitfuncs:
Traceback (most recent call last):
File "/usr/lib64/python2.6/atexit.py", line 24, in _run_exitfuncs
func(*targs, **kargs)
File "/usr/lib64/python2.6/multiprocessing/util.py", line 258, in _exit_function
info('process shutting down')
TypeError: 'NoneType' object is not callable
Error in atexit._run_exitfuncs:
Traceback (most recent call last):
File "/usr/lib64/python2.6/atexit.py", line 24, in _run_exitfuncs
func(*targs, **kargs)
File "/usr/lib64/python2.6/multiprocessing/util.py", line 258, in _exit_function
info('process shutting down')
TypeError: 'NoneType' object is not callable
Error in sys.exitfunc:
Traceback (most recent call last):
File "/usr/lib64/python2.6/atexit.py", line 24, in _run_exitfuncs
func(*targs, **kargs)
File "/usr/lib64/python2.6/multiprocessing/util.py", line 258, in _exit_function
info('process shutting down')
TypeError: 'NoneType' object is not callable
Downloading/unpacking python-swiftclient (from -r <https://jenkins01.openstack.org/job/periodic-ceilometer-python26-stable-gri…> (line 16))
Running setup.py egg_info for package python-swiftclient
Installed <https://jenkins01.openstack.org/job/periodic-ceilometer-python26-stable-gri…>
Searching for d2to1
Reading https://pypi.python.org/simple/d2to1/
Best match: d2to1 0.2.10
Downloading https://pypi.python.org/packages/source/d/d2to1/d2to1-0.2.10.tar.gz#md5=be9…
Processing d2to1-0.2.10.tar.gz
Writing /tmp/tmp.h5Ilk60TdJ/easy_install-9eFrlY/d2to1-0.2.10/setup.cfg
Running d2to1-0.2.10/setup.py -q bdist_egg --dist-dir /tmp/tmp.h5Ilk60TdJ/easy_install-9eFrlY/d2to1-0.2.10/egg-dist-tmp-vorHPF
Installed <https://jenkins01.openstack.org/job/periodic-ceilometer-python26-stable-gri…>
[pbr] Processing SOURCES.txt
warning: LocalManifestMaker: standard file '-c' not found
[pbr] In git context, generating filelist from git
warning: no previously-included files matching '*.pyc' found anywhere in distribution
warning: no files found matching '*' under directory 'tools'
Error in atexit._run_exitfuncs:
Traceback (most recent call last):
File "/usr/lib64/python2.6/atexit.py", line 24, in _run_exitfuncs
func(*targs, **kargs)
File "/usr/lib64/python2.6/multiprocessing/util.py", line 258, in _exit_function
info('process shutting down')
TypeError: 'NoneType' object is not callable
Error in atexit._run_exitfuncs:
Traceback (most recent call last):
File "/usr/lib64/python2.6/atexit.py", line 24, in _run_exitfuncs
func(*targs, **kargs)
File "/usr/lib64/python2.6/multiprocessing/util.py", line 258, in _exit_function
info('process shutting down')
TypeError: 'NoneType' object is not callable
Error in sys.exitfunc:
Traceback (most recent call last):
File "/usr/lib64/python2.6/atexit.py", line 24, in _run_exitfuncs
func(*targs, **kargs)
File "/usr/lib64/python2.6/multiprocessing/util.py", line 258, in _exit_function
info('process shutting down')
TypeError: 'NoneType' object is not callable
Downloading/unpacking lxml (from -r <https://jenkins01.openstack.org/job/periodic-ceilometer-python26-stable-gri…> (line 17))
Running setup.py egg_info for package lxml
/usr/lib64/python2.6/distutils/dist.py:266: UserWarning: Unknown distribution option: 'bugtrack_url'
warnings.warn(msg)
Building lxml version 3.2.3.
Building without Cython.
Using build configuration of libxslt 1.1.26
Building against libxml2/libxslt in the following directory: /usr/lib64
warning: no previously-included files found matching '*.py'
warning: no files found matching '*.txt' under directory 'src/lxml/tests'
Downloading/unpacking requests>=1.1 (from -r <https://jenkins01.openstack.org/job/periodic-ceilometer-python26-stable-gri…> (line 18))
Running setup.py egg_info for package requests
Downloading/unpacking extras (from -r <https://jenkins01.openstack.org/job/periodic-ceilometer-python26-stable-gri…> (line 19))
Downloading extras-0.0.3.tar.gz
Running setup.py egg_info for package extras
Downloading/unpacking wsme>=0.5b1 (from -r <https://jenkins01.openstack.org/job/periodic-ceilometer-python26-stable-gri…> (line 20))
Running setup.py egg_info for package wsme
Installed <https://jenkins01.openstack.org/job/periodic-ceilometer-python26-stable-gri…>
[d2to1] running patched manifest_maker command with extra_files support
warning: no files found matching '*.ini' under directory 'tests'
Error in atexit._run_exitfuncs:
Traceback (most recent call last):
File "/usr/lib64/python2.6/atexit.py", line 24, in _run_exitfuncs
func(*targs, **kargs)
File "/usr/lib64/python2.6/multiprocessing/util.py", line 258, in _exit_function
info('process shutting down')
TypeError: 'NoneType' object is not callable
Error in sys.exitfunc:
Traceback (most recent call last):
File "/usr/lib64/python2.6/atexit.py", line 24, in _run_exitfuncs
func(*targs, **kargs)
File "/usr/lib64/python2.6/multiprocessing/util.py", line 258, in _exit_function
info('process shutting down')
TypeError: 'NoneType' object is not callable
Downloading/unpacking pyyaml (from -r <https://jenkins01.openstack.org/job/periodic-ceilometer-python26-stable-gri…> (line 21))
Running setup.py egg_info for package pyyaml
Downloading/unpacking oslo.config>=1.1.0 (from -r <https://jenkins01.openstack.org/job/periodic-ceilometer-python26-stable-gri…> (line 22))
Running setup.py egg_info for package oslo.config
warning: no previously-included files found matching '.gitignore'
warning: no previously-included files found matching '.gitreview'
Downloading/unpacking happybase>=0.4 (from -r <https://jenkins01.openstack.org/job/periodic-ceilometer-python26-stable-gri…> (line 23))
Running setup.py egg_info for package happybase
Downloading/unpacking Cheetah>=2.4.4 (from nova==2013.1->-r <https://jenkins01.openstack.org/job/periodic-ceilometer-python26-stable-gri…> (line 11))
Running setup.py egg_info for package Cheetah
warning: no files found matching 'examples'
warning: no files found matching 'docs'
warning: no files found matching 'bin'
warning: no files found matching '*' under directory 'docs'
warning: no files found matching '*' under directory 'examples'
warning: no previously-included files matching '*.pyc' found under directory 'cheetah'
warning: no previously-included files matching '*~' found under directory 'cheetah'
warning: no previously-included files matching '*.aux' found under directory 'cheetah'
warning: no previously-included files matching '*~' found under directory 'docs'
warning: no previously-included files matching '*.aux' found under directory 'docs'
Downloading/unpacking amqplib>=0.6.1 (from nova==2013.1->-r <https://jenkins01.openstack.org/job/periodic-ceilometer-python26-stable-gri…> (line 11))
Running setup.py egg_info for package amqplib
Downloading/unpacking boto (from nova==2013.1->-r <https://jenkins01.openstack.org/job/periodic-ceilometer-python26-stable-gri…> (line 11))
Running setup.py egg_info for package boto
warning: no files found matching 'boto/mturk/test/*.doctest'
warning: no files found matching 'boto/mturk/test/.gitignore'
Downloading/unpacking routes>=1.12.3 (from nova==2013.1->-r <https://jenkins01.openstack.org/job/periodic-ceilometer-python26-stable-gri…> (line 11))
Running setup.py egg_info for package routes
warning: no previously-included files matching '.DS_Store' found anywhere in distribution
warning: no previously-included files matching '*.hgignore' found anywhere in distribution
warning: no previously-included files matching '*.hgtags' found anywhere in distribution
Downloading/unpacking greenlet>=0.3.1 (from nova==2013.1->-r <https://jenkins01.openstack.org/job/periodic-ceilometer-python26-stable-gri…> (line 11))
Running setup.py egg_info for package greenlet
Downloading/unpacking PasteDeploy>=1.5.0 (from nova==2013.1->-r <https://jenkins01.openstack.org/job/periodic-ceilometer-python26-stable-gri…> (line 11))
Downloading PasteDeploy-1.5.0.tar.gz
Running setup.py egg_info for package PasteDeploy
Downloading/unpacking paste (from nova==2013.1->-r <https://jenkins01.openstack.org/job/periodic-ceilometer-python26-stable-gri…> (line 11))
Running setup.py egg_info for package paste
warning: no previously-included files matching '*' found under directory 'docs/_build/_sources'
Downloading/unpacking netaddr>=0.7.6 (from nova==2013.1->-r <https://jenkins01.openstack.org/job/periodic-ceilometer-python26-stable-gri…> (line 11))
Could not find a version that satisfies the requirement netaddr>=0.7.6 (from nova==2013.1->-r <https://jenkins01.openstack.org/job/periodic-ceilometer-python26-stable-gri…> (line 11)) (from versions: 0.7.1, 0.6.3, 0.6.2, 0.7.3, 0.7.3, 0.5, 0.6, 0.4, 0.6.4, 0.7.2, 0.6.1, 0.7.2, 0.5.1, 0.6.1, 0.6, 0.6.4, 0.5.2, 0.3.1, 0.7.1, 0.6.3, 0.5, 0.6.2, 0.3.1, 0.7, 0.7, 0.5.1, 0.4, 0.5.2, 0.7.4, 0.7.4, 0.7.3, 0.7.3, 0.7.2, 0.7.2, 0.7.1, 0.7.1, 0.7, 0.7, 0.6.4, 0.6.4, 0.6.3, 0.6.3, 0.6.2, 0.6.2, 0.6.1, 0.6.1, 0.6, 0.6, 0.5.2, 0.5.2, 0.5.1, 0.5.1, 0.5, 0.5, 0.4, 0.4, 0.3.1, 0.3.1, 0.3, 0.3, 0.2, 0.1)
Cleaning up...
No distributions matching the version for netaddr>=0.7.6 (from nova==2013.1->-r <https://jenkins01.openstack.org/job/periodic-ceilometer-python26-stable-gri…> (line 11))
Storing complete log in <https://jenkins01.openstack.org/job/periodic-ceilometer-python26-stable-gri…>
ERROR: could not install deps [-r<https://jenkins01.openstack.org/job/periodic-ceilometer-python26-stable-gri…,> -r<https://jenkins01.openstack.org/job/periodic-ceilometer-python26-stable-gri…]>
___________________________________ summary ____________________________________
ERROR: py26: could not install deps [-r<https://jenkins01.openstack.org/job/periodic-ceilometer-python26-stable-gri…,> -r<https://jenkins01.openstack.org/job/periodic-ceilometer-python26-stable-gri…]>
+ result=1
+ echo 'Begin pip freeze output from test virtualenv:'
Begin pip freeze output from test virtualenv:
+ echo ======================================================================
======================================================================
+ .tox/py26/bin/pip freeze
+ echo ======================================================================
======================================================================
+ '[' -d .testrepository ']'
+ sudo /usr/local/jenkins/slave_scripts/jenkins-sudo-grep.sh post
+ sudoresult=0
+ '[' 0 -ne 0 ']'
+ /usr/local/jenkins/slave_scripts/jenkins-oom-grep.sh post
+ oomresult=0
+ '[' 0 -ne 0 ']'
++ find . -name nose_results.html
+ htmlreport=
+ '[' -f '' ']'
+ echo
+ echo 'WARNING: Unable to find to confirm results!'
WARNING: Unable to find to confirm results!
+ echo
+ exit 1
+ rm -rf /tmp/tmp.h5Ilk60TdJ
Build step 'Execute shell' marked build as failure
[SCP] Connecting to static.openstack.org
[SCP] No file(s) found: **/*nose_results.html
[SCP] '**/*nose_results.html' doesn't match anything: '**' exists but not '**/*nose_results.html'
[SCP] Connecting to static.openstack.org
[SCP] Trying to create /srv/static/logs/periodic/periodic-ceilometer-python26-stable-grizzly/centos6-5/4
[SCP] Copying console log.
1
1
16 Aug '13
See <https://jenkins02.openstack.org/job/periodic-nova-python26-stable-grizzly/5/>
------------------------------------------
Started by user anonymous
[EnvInject] - Loading node environment variables.
Building remotely on centos6-12 in workspace <https://jenkins02.openstack.org/job/periodic-nova-python26-stable-grizzly/w…>
Checkout:periodic-nova-python26-stable-grizzly / <https://jenkins02.openstack.org/job/periodic-nova-python26-stable-grizzly/w…> - hudson.remoting.Channel@1559dca5:centos6-12
Using strategy: Default
Last Built Revision: Revision 37e3b55ad2f9ae581a30927f13442d68364babbc (origin/stable/grizzly)
Wiping out workspace first.
Cloning the remote Git repository
Cloning repository git://github.com/openstack/nova.git
git --version
git version 1.7.1
Fetching upstream changes from git://github.com/openstack/nova.git
Commencing build of Revision 37e3b55ad2f9ae581a30927f13442d68364babbc (origin/stable/grizzly)
Checking out Revision 37e3b55ad2f9ae581a30927f13442d68364babbc (origin/stable/grizzly)
[periodic-nova-python26-stable-grizzly] $ /bin/bash -xe /tmp/hudson8824066657474377880.sh
+ /usr/local/jenkins/slave_scripts/run-tox.sh 26 openstack nova
+ version=26
+ org=openstack
+ project=nova
+ [[ -z 26 ]]
+ [[ -z openstack ]]
+ [[ -z nova ]]
+ venv=py26
+ export NOSE_WITH_XUNIT=1
+ NOSE_WITH_XUNIT=1
+ export NOSE_WITH_HTML_OUTPUT=1
+ NOSE_WITH_HTML_OUTPUT=1
+ export NOSE_HTML_OUT_FILE=nose_results.html
+ NOSE_HTML_OUT_FILE=nose_results.html
++ /bin/mktemp -d
+ export TMPDIR=/tmp/tmp.7U6w1FZONO
+ TMPDIR=/tmp/tmp.7U6w1FZONO
+ trap 'rm -rf /tmp/tmp.7U6w1FZONO' EXIT
+ /usr/local/jenkins/slave_scripts/jenkins-oom-grep.sh pre
+ sudo /usr/local/jenkins/slave_scripts/jenkins-sudo-grep.sh pre
+ /usr/local/jenkins/slave_scripts/select-mirror.sh openstack nova
+ org=openstack
+ project=nova
+ [[ -z openstack ]]
+ [[ -z nova ]]
+ rm -f /home/jenkins/.pydistutils.cfg
+ mkdir -p /home/jenkins/.pip
+ rm -f /home/jenkins/.pip/pip.conf
+ '[' openstack == openstack ']'
+ '[' nova == requirements ']'
+ '[' openstack == openstack ']'
+ cat
+ cat
+ python setup.py --version
jenkins.periodic.nova.python26.stable.grizzly.5
+ tox -epy26
GLOB sdist-make: <https://jenkins02.openstack.org/job/periodic-nova-python26-stable-grizzly/w…>
py26 create: <https://jenkins02.openstack.org/job/periodic-nova-python26-stable-grizzly/w…>
py26 installdeps: -r<https://jenkins02.openstack.org/job/periodic-nova-python26-stable-grizzly/w…,> -r<https://jenkins02.openstack.org/job/periodic-nova-python26-stable-grizzly/w…>
ERROR: invocation failed, logfile: <https://jenkins02.openstack.org/job/periodic-nova-python26-stable-grizzly/w…>
ERROR: actionid=py26
msg=getenv
cmdargs=[local('<https://jenkins02.openstack.org/job/periodic-nova-python26-stable-grizzly/w…'),> 'install', '--pre', '-r<https://jenkins02.openstack.org/job/periodic-nova-python26-stable-grizzly/w…',> '-r<https://jenkins02.openstack.org/job/periodic-nova-python26-stable-grizzly/w…']>
env={'JENKINS_HOME': '/var/lib/jenkins', 'PYTHONIOENCODING': 'utf_8', 'BUILD_CAUSE': 'USERIDCAUSE', 'HUDSON_URL': 'https://jenkins02.openstack.org/', 'BUILD_URL': 'https://jenkins02.openstack.org/job/periodic-nova-python26-stable-grizzly/5/', 'BUILD_TAG': 'jenkins-periodic-nova-python26-stable-grizzly-5', 'SSH_CLIENT': '166.78.48.99 54837 22', 'JENKINS_URL': 'https://jenkins02.openstack.org/', 'LOGNAME': 'jenkins', 'USER': 'jenkins', 'WORKSPACE': '<https://jenkins02.openstack.org/job/periodic-nova-python26-stable-grizzly/w…',> 'PATH': '<https://jenkins02.openstack.org/job/periodic-nova-python26-stable-grizzly/w…>:/usr/local/bin:/bin:/usr/bin', 'NODE_LABELS': 'centos6 centos6-12', 'DEBFULLNAME': 'OpenStack Hudson', 'JOB_NAME': 'periodic-nova-python26-stable-grizzly', 'ZUUL_PROJECT': 'openstack/nova', 'LANG': 'en_US.UTF-8', 'VIRTUAL_ENV': '<https://jenkins02.openstack.org/job/periodic-nova-python26-stable-grizzly/w…',> 'SHELL': '/bin/bash', 'LANGUAGE': 'en_US:en', 'SHLVL': '3', 'NLSPATH': '/usr/dt/lib/nls/msg/%L/%N.cat', 'GIT_AUTHOR_EMAIL': 'jenkins(a)openstack.org', 'HUDSON_HOME': '/var/lib/jenkins', 'TMPDIR': '/tmp/tmp.7U6w1FZONO', 'DEBEMAIL': 'hudson(a)openstack.org', 'HOME': '<https://jenkins02.openstack.org/job/periodic-nova-python26-stable-grizzly/w…',> 'NOSE_WITH_HTML_OUTPUT': '1', 'BUILD_ID': '2013-08-16_06-00-46', 'BUILD_NUMBER': '5', 'HUDSON_COOKIE': 'ae3534d1-6306-4d20-a760-342b601c9999', 'JOB_URL': 'https://jenkins02.openstack.org/job/periodic-nova-python26-stable-grizzly/', 'BASE_LOG_PATH': 'periodic', 'BUILD_CAUSE_USERIDCAUSE': 'true', 'GIT_COMMIT': '37e3b55ad2f9ae581a30927f13442d68364babbc', 'GIT_AUTHOR_NAME': 'OpenStack Jenkins', 'LC_ALL': 'C', 'GIT_COMMITTER_NAME': 'OpenStack Jenkins', 'NOSE_WITH_XUNIT': '1', '_': '/usr/bin/tox', 'ZUUL_PIPELINE': 'periodic', 'ZUUL_UUID': 'fb4d682c9f0e47d49254154ce9c8af9d', 'HUDSON_SERVER_COOKIE': 'a8c4be63eae9909c', 'EXECUTOR_NUMBER': '0', 'NODE_NAME': 'centos6-12', 'LOG_PATH': 'periodic/periodic-nova-python26-stable-grizzly/fb4d682', 'PWD': '<https://jenkins02.openstack.org/job/periodic-nova-python26-stable-grizzly/w…',> 'GIT_COMMITTER_EMAIL': 'jenkins(a)openstack.org', 'JENKINS_SERVER_COOKIE': 'a8c4be63eae9909c', 'BUILD_DISPLAY_NAME': '#5', 'XFILESEARCHPATH': '/usr/dt/app-defaults/%L/Dt', 'MAIL': '/var/mail/jenkins', 'SSH_CONNECTION': '166.78.48.99 54837 166.78.18.38 22', 'NOSE_HTML_OUT_FILE': 'nose_results.html', 'GIT_BRANCH': 'origin/stable/grizzly'}
Downloading/unpacking SQLAlchemy>=0.7.8,<0.7.99 (from -r <https://jenkins02.openstack.org/job/periodic-nova-python26-stable-grizzly/w…> (line 1))
Running setup.py egg_info for package SQLAlchemy
warning: no files found matching '*.jpg' under directory 'doc'
no previously-included directories found matching 'doc/build/output'
Downloading/unpacking Cheetah>=2.4.4 (from -r <https://jenkins02.openstack.org/job/periodic-nova-python26-stable-grizzly/w…> (line 2))
Running setup.py egg_info for package Cheetah
warning: no files found matching 'examples'
warning: no files found matching 'docs'
warning: no files found matching 'bin'
warning: no files found matching '*' under directory 'docs'
warning: no files found matching '*' under directory 'examples'
warning: no previously-included files matching '*.pyc' found under directory 'cheetah'
warning: no previously-included files matching '*~' found under directory 'cheetah'
warning: no previously-included files matching '*.aux' found under directory 'cheetah'
warning: no previously-included files matching '*~' found under directory 'docs'
warning: no previously-included files matching '*.aux' found under directory 'docs'
Downloading/unpacking amqplib>=0.6.1 (from -r <https://jenkins02.openstack.org/job/periodic-nova-python26-stable-grizzly/w…> (line 3))
Running setup.py egg_info for package amqplib
Downloading/unpacking anyjson>=0.2.4 (from -r <https://jenkins02.openstack.org/job/periodic-nova-python26-stable-grizzly/w…> (line 4))
Downloading anyjson-0.3.3.tar.gz
Running setup.py egg_info for package anyjson
Downloading/unpacking argparse (from -r <https://jenkins02.openstack.org/job/periodic-nova-python26-stable-grizzly/w…> (line 5))
You are installing an externally hosted file. Future versions of pip will default to disallowing externally hosted files.
Running setup.py egg_info for package argparse
warning: no previously-included files matching '*.pyc' found anywhere in distribution
warning: no previously-included files matching '*.pyo' found anywhere in distribution
warning: no previously-included files matching '*.orig' found anywhere in distribution
warning: no previously-included files matching '*.rej' found anywhere in distribution
no previously-included directories found matching 'doc/_build'
no previously-included directories found matching 'env24'
no previously-included directories found matching 'env25'
no previously-included directories found matching 'env26'
no previously-included directories found matching 'env27'
Downloading/unpacking boto (from -r <https://jenkins02.openstack.org/job/periodic-nova-python26-stable-grizzly/w…> (line 6))
Running setup.py egg_info for package boto
warning: no files found matching 'boto/mturk/test/*.doctest'
warning: no files found matching 'boto/mturk/test/.gitignore'
Downloading/unpacking eventlet>=0.9.17 (from -r <https://jenkins02.openstack.org/job/periodic-nova-python26-stable-grizzly/w…> (line 7))
Running setup.py egg_info for package eventlet
Downloading/unpacking kombu>=1.0.4 (from -r <https://jenkins02.openstack.org/job/periodic-nova-python26-stable-grizzly/w…> (line 8))
Running setup.py egg_info for package kombu
Downloading/unpacking lxml>=2.3 (from -r <https://jenkins02.openstack.org/job/periodic-nova-python26-stable-grizzly/w…> (line 9))
Running setup.py egg_info for package lxml
/usr/lib64/python2.6/distutils/dist.py:266: UserWarning: Unknown distribution option: 'bugtrack_url'
warnings.warn(msg)
Building lxml version 3.2.3.
Building without Cython.
Using build configuration of libxslt 1.1.26
Building against libxml2/libxslt in the following directory: /usr/lib64
warning: no previously-included files found matching '*.py'
warning: no files found matching '*.txt' under directory 'src/lxml/tests'
Downloading/unpacking routes>=1.12.3 (from -r <https://jenkins02.openstack.org/job/periodic-nova-python26-stable-grizzly/w…> (line 10))
Running setup.py egg_info for package routes
warning: no previously-included files matching '.DS_Store' found anywhere in distribution
warning: no previously-included files matching '*.hgignore' found anywhere in distribution
warning: no previously-included files matching '*.hgtags' found anywhere in distribution
Downloading/unpacking WebOb==1.2.3 (from -r <https://jenkins02.openstack.org/job/periodic-nova-python26-stable-grizzly/w…> (line 11))
Running setup.py egg_info for package WebOb
no previously-included directories found matching '*.pyc'
no previously-included directories found matching '*.pyo'
Downloading/unpacking greenlet>=0.3.1 (from -r <https://jenkins02.openstack.org/job/periodic-nova-python26-stable-grizzly/w…> (line 12))
Running setup.py egg_info for package greenlet
Downloading/unpacking PasteDeploy>=1.5.0 (from -r <https://jenkins02.openstack.org/job/periodic-nova-python26-stable-grizzly/w…> (line 13))
Downloading PasteDeploy-1.5.0.tar.gz
Running setup.py egg_info for package PasteDeploy
Downloading/unpacking paste (from -r <https://jenkins02.openstack.org/job/periodic-nova-python26-stable-grizzly/w…> (line 14))
Running setup.py egg_info for package paste
warning: no previously-included files matching '*' found under directory 'docs/_build/_sources'
Downloading/unpacking sqlalchemy-migrate>=0.7.2 (from -r <https://jenkins02.openstack.org/job/periodic-nova-python26-stable-grizzly/w…> (line 15))
Running setup.py egg_info for package sqlalchemy-migrate
warning: no files found matching '*' under directory 'tests'
warning: no previously-included files matching '*pyc' found anywhere in distribution
warning: no previously-included files found matching '.hgtags'
warning: no previously-included files matching '*' found under directory 'docs/_build'
Downloading/unpacking netaddr>=0.7.6 (from -r <https://jenkins02.openstack.org/job/periodic-nova-python26-stable-grizzly/w…> (line 16))
Could not find a version that satisfies the requirement netaddr>=0.7.6 (from -r <https://jenkins02.openstack.org/job/periodic-nova-python26-stable-grizzly/w…> (line 16)) (from versions: 0.7.1, 0.6.3, 0.6.2, 0.7.3, 0.7.3, 0.5, 0.6, 0.4, 0.6.4, 0.7.2, 0.6.1, 0.7.2, 0.5.1, 0.6.1, 0.6, 0.6.4, 0.5.2, 0.3.1, 0.7.1, 0.6.3, 0.5, 0.6.2, 0.3.1, 0.7, 0.7, 0.5.1, 0.4, 0.5.2, 0.7.4, 0.7.4, 0.7.3, 0.7.3, 0.7.2, 0.7.2, 0.7.1, 0.7.1, 0.7, 0.7, 0.6.4, 0.6.4, 0.6.3, 0.6.3, 0.6.2, 0.6.2, 0.6.1, 0.6.1, 0.6, 0.6, 0.5.2, 0.5.2, 0.5.1, 0.5.1, 0.5, 0.5, 0.4, 0.4, 0.3.1, 0.3.1, 0.3, 0.3, 0.2, 0.1)
Cleaning up...
No distributions matching the version for netaddr>=0.7.6 (from -r <https://jenkins02.openstack.org/job/periodic-nova-python26-stable-grizzly/w…> (line 16))
Storing complete log in <https://jenkins02.openstack.org/job/periodic-nova-python26-stable-grizzly/w…>
ERROR: could not install deps [-r<https://jenkins02.openstack.org/job/periodic-nova-python26-stable-grizzly/w…,> -r<https://jenkins02.openstack.org/job/periodic-nova-python26-stable-grizzly/w…]>
___________________________________ summary ____________________________________
ERROR: py26: could not install deps [-r<https://jenkins02.openstack.org/job/periodic-nova-python26-stable-grizzly/w…,> -r<https://jenkins02.openstack.org/job/periodic-nova-python26-stable-grizzly/w…]>
+ result=1
+ echo 'Begin pip freeze output from test virtualenv:'
Begin pip freeze output from test virtualenv:
+ echo ======================================================================
======================================================================
+ .tox/py26/bin/pip freeze
+ echo ======================================================================
======================================================================
+ '[' -d .testrepository ']'
+ sudo /usr/local/jenkins/slave_scripts/jenkins-sudo-grep.sh post
+ sudoresult=0
+ '[' 0 -ne 0 ']'
+ /usr/local/jenkins/slave_scripts/jenkins-oom-grep.sh post
+ oomresult=0
+ '[' 0 -ne 0 ']'
++ find . -name nose_results.html
+ htmlreport=
+ '[' -f '' ']'
+ echo
+ echo 'WARNING: Unable to find to confirm results!'
WARNING: Unable to find to confirm results!
+ echo
+ exit 1
+ rm -rf /tmp/tmp.7U6w1FZONO
Build step 'Execute shell' marked build as failure
[SCP] Connecting to static.openstack.org
[SCP] No file(s) found: **/*nose_results.html
[SCP] '**/*nose_results.html' doesn't match anything: '**' exists but not '**/*nose_results.html'
[SCP] Connecting to static.openstack.org
[SCP] Trying to create /srv/static/logs/periodic/periodic-nova-python26-stable-grizzly/centos6-12/5
[SCP] Copying console log.
1
1
16 Aug '13
See <https://jenkins01.openstack.org/job/periodic-nova-python27-stable-grizzly/6/>
------------------------------------------
Started by user anonymous
[EnvInject] - Loading node environment variables.
Building remotely on precise7 in workspace <https://jenkins01.openstack.org/job/periodic-nova-python27-stable-grizzly/w…>
Checkout:periodic-nova-python27-stable-grizzly / <https://jenkins01.openstack.org/job/periodic-nova-python27-stable-grizzly/w…> - hudson.remoting.Channel@116bb1ca:precise7
Using strategy: Default
Last Built Revision: Revision 37e3b55ad2f9ae581a30927f13442d68364babbc (origin/stable/grizzly)
Wiping out workspace first.
Cloning the remote Git repository
Cloning repository git://github.com/openstack/nova.git
git --version
git version 1.7.9.5
Fetching upstream changes from git://github.com/openstack/nova.git
Commencing build of Revision 37e3b55ad2f9ae581a30927f13442d68364babbc (origin/stable/grizzly)
Checking out Revision 37e3b55ad2f9ae581a30927f13442d68364babbc (origin/stable/grizzly)
[periodic-nova-python27-stable-grizzly] $ /bin/bash -xe /tmp/hudson3025313129106221997.sh
+ /usr/local/jenkins/slave_scripts/run-tox.sh 27 openstack nova
+ version=27
+ org=openstack
+ project=nova
+ [[ -z 27 ]]
+ [[ -z openstack ]]
+ [[ -z nova ]]
+ venv=py27
+ export NOSE_WITH_XUNIT=1
+ NOSE_WITH_XUNIT=1
+ export NOSE_WITH_HTML_OUTPUT=1
+ NOSE_WITH_HTML_OUTPUT=1
+ export NOSE_HTML_OUT_FILE=nose_results.html
+ NOSE_HTML_OUT_FILE=nose_results.html
++ /bin/mktemp -d
+ export TMPDIR=/tmp/tmp.fTYYvZUvnv
+ TMPDIR=/tmp/tmp.fTYYvZUvnv
+ trap 'rm -rf /tmp/tmp.fTYYvZUvnv' EXIT
+ /usr/local/jenkins/slave_scripts/jenkins-oom-grep.sh pre
+ sudo /usr/local/jenkins/slave_scripts/jenkins-sudo-grep.sh pre
+ /usr/local/jenkins/slave_scripts/select-mirror.sh openstack nova
+ org=openstack
+ project=nova
+ [[ -z openstack ]]
+ [[ -z nova ]]
+ rm -f /home/jenkins/.pydistutils.cfg
+ mkdir -p /home/jenkins/.pip
+ rm -f /home/jenkins/.pip/pip.conf
+ '[' openstack == openstack ']'
+ '[' nova == requirements ']'
+ '[' openstack == openstack ']'
+ cat
+ cat
+ python setup.py --version
jenkins.periodic.nova.python27.stable.grizzly.6
+ tox -epy27
GLOB sdist-make: <https://jenkins01.openstack.org/job/periodic-nova-python27-stable-grizzly/w…>
py27 create: <https://jenkins01.openstack.org/job/periodic-nova-python27-stable-grizzly/w…>
py27 installdeps: -r<https://jenkins01.openstack.org/job/periodic-nova-python27-stable-grizzly/w…,> -r<https://jenkins01.openstack.org/job/periodic-nova-python27-stable-grizzly/w…>
ERROR: invocation failed, logfile: <https://jenkins01.openstack.org/job/periodic-nova-python27-stable-grizzly/w…>
ERROR: actionid=py27
msg=getenv
cmdargs=[local('<https://jenkins01.openstack.org/job/periodic-nova-python27-stable-grizzly/w…'),> 'install', '--pre', '-r<https://jenkins01.openstack.org/job/periodic-nova-python27-stable-grizzly/w…',> '-r<https://jenkins01.openstack.org/job/periodic-nova-python27-stable-grizzly/w…']>
env={'JENKINS_HOME': '/var/lib/jenkins', 'PYTHONIOENCODING': 'utf_8', 'BUILD_CAUSE': 'USERIDCAUSE', 'HUDSON_URL': 'https://jenkins01.openstack.org/', 'BUILD_URL': 'https://jenkins01.openstack.org/job/periodic-nova-python27-stable-grizzly/6/', 'BUILD_TAG': 'jenkins-periodic-nova-python27-stable-grizzly-6', 'SSH_CLIENT': '166.78.188.99 47753 22', 'JENKINS_URL': 'https://jenkins01.openstack.org/', 'LOGNAME': 'jenkins', 'USER': 'jenkins', 'WORKSPACE': '<https://jenkins01.openstack.org/job/periodic-nova-python27-stable-grizzly/w…',> 'PATH': '<https://jenkins01.openstack.org/job/periodic-nova-python27-stable-grizzly/w…>:/usr/local/sbin:/usr/local/bin:/usr/sbin:/usr/bin:/sbin:/bin:/usr/games', 'NODE_LABELS': 'precise precise7', 'DEBFULLNAME': 'OpenStack Hudson', 'JOB_NAME': 'periodic-nova-python27-stable-grizzly', 'ZUUL_PROJECT': 'openstack/nova', 'LANG': 'en_US.UTF-8', 'VIRTUAL_ENV': '<https://jenkins01.openstack.org/job/periodic-nova-python27-stable-grizzly/w…',> 'SHELL': '/bin/bash', 'XDG_SESSION_COOKIE': '46b38f61d2217983c255af8300000421-1376524209.101585-973077270', 'LANGUAGE': 'en_US:en', 'SHLVL': '3', 'GIT_AUTHOR_EMAIL': 'jenkins(a)openstack.org', 'HUDSON_HOME': '/var/lib/jenkins', 'TMPDIR': '/tmp/tmp.fTYYvZUvnv', 'DEBEMAIL': 'hudson(a)openstack.org', 'HOME': '<https://jenkins01.openstack.org/job/periodic-nova-python27-stable-grizzly/w…',> 'NOSE_WITH_HTML_OUTPUT': '1', 'BUILD_ID': '2013-08-16_06-12-25', 'BUILD_NUMBER': '6', 'HUDSON_COOKIE': '01a53d28-d67d-4717-8a7a-773350ea55dd', 'JOB_URL': 'https://jenkins01.openstack.org/job/periodic-nova-python27-stable-grizzly/', 'BASE_LOG_PATH': 'periodic', 'BUILD_CAUSE_USERIDCAUSE': 'true', 'GIT_COMMIT': '37e3b55ad2f9ae581a30927f13442d68364babbc', 'GIT_AUTHOR_NAME': 'OpenStack Jenkins', 'LC_ALL': 'C', 'GIT_COMMITTER_NAME': 'OpenStack Jenkins', 'NOSE_WITH_XUNIT': '1', '_': '/usr/local/bin/tox', 'ZUUL_PIPELINE': 'periodic', 'ZUUL_UUID': '9176f99260214fa78d915dbe2f0d7550', 'HUDSON_SERVER_COOKIE': 'a8c4be63eae9909c', 'EXECUTOR_NUMBER': '0', 'NODE_NAME': 'precise7', 'LOG_PATH': 'periodic/periodic-nova-python27-stable-grizzly/9176f99', 'PWD': '<https://jenkins01.openstack.org/job/periodic-nova-python27-stable-grizzly/w…',> 'GIT_COMMITTER_EMAIL': 'jenkins(a)openstack.org', 'JENKINS_SERVER_COOKIE': 'a8c4be63eae9909c', 'BUILD_DISPLAY_NAME': '#6', 'MAIL': '/var/mail/jenkins', 'SSH_CONNECTION': '166.78.188.99 47753 166.78.178.178 22', 'NOSE_HTML_OUT_FILE': 'nose_results.html', 'GIT_BRANCH': 'origin/stable/grizzly'}
Downloading/unpacking SQLAlchemy>=0.7.8,<0.7.99 (from -r <https://jenkins01.openstack.org/job/periodic-nova-python27-stable-grizzly/w…> (line 1))
Running setup.py egg_info for package SQLAlchemy
warning: no files found matching '*.jpg' under directory 'doc'
no previously-included directories found matching 'doc/build/output'
Downloading/unpacking Cheetah>=2.4.4 (from -r <https://jenkins01.openstack.org/job/periodic-nova-python27-stable-grizzly/w…> (line 2))
Running setup.py egg_info for package Cheetah
warning: no files found matching 'examples'
warning: no files found matching 'docs'
warning: no files found matching 'bin'
warning: no files found matching '*' under directory 'docs'
warning: no files found matching '*' under directory 'examples'
warning: no previously-included files matching '*.pyc' found under directory 'cheetah'
warning: no previously-included files matching '*~' found under directory 'cheetah'
warning: no previously-included files matching '*.aux' found under directory 'cheetah'
warning: no previously-included files matching '*~' found under directory 'docs'
warning: no previously-included files matching '*.aux' found under directory 'docs'
Downloading/unpacking amqplib>=0.6.1 (from -r <https://jenkins01.openstack.org/job/periodic-nova-python27-stable-grizzly/w…> (line 3))
Running setup.py egg_info for package amqplib
Downloading/unpacking anyjson>=0.2.4 (from -r <https://jenkins01.openstack.org/job/periodic-nova-python27-stable-grizzly/w…> (line 4))
Downloading anyjson-0.3.3.tar.gz
Running setup.py egg_info for package anyjson
Requirement already satisfied (use --upgrade to upgrade): argparse in /usr/lib/python2.7 (from -r <https://jenkins01.openstack.org/job/periodic-nova-python27-stable-grizzly/w…> (line 5))
Downloading/unpacking boto (from -r <https://jenkins01.openstack.org/job/periodic-nova-python27-stable-grizzly/w…> (line 6))
Running setup.py egg_info for package boto
warning: no files found matching 'boto/mturk/test/*.doctest'
warning: no files found matching 'boto/mturk/test/.gitignore'
Downloading/unpacking eventlet>=0.9.17 (from -r <https://jenkins01.openstack.org/job/periodic-nova-python27-stable-grizzly/w…> (line 7))
Running setup.py egg_info for package eventlet
Downloading/unpacking kombu>=1.0.4 (from -r <https://jenkins01.openstack.org/job/periodic-nova-python27-stable-grizzly/w…> (line 8))
Running setup.py egg_info for package kombu
Downloading/unpacking lxml>=2.3 (from -r <https://jenkins01.openstack.org/job/periodic-nova-python27-stable-grizzly/w…> (line 9))
Running setup.py egg_info for package lxml
/usr/lib/python2.7/distutils/dist.py:267: UserWarning: Unknown distribution option: 'bugtrack_url'
warnings.warn(msg)
Building lxml version 3.2.3.
Building without Cython.
Using build configuration of libxslt 1.1.26
Building against libxml2/libxslt in the following directory: /usr/lib/x86_64-linux-gnu
warning: no previously-included files found matching '*.py'
warning: no files found matching '*.txt' under directory 'src/lxml/tests'
Downloading/unpacking routes>=1.12.3 (from -r <https://jenkins01.openstack.org/job/periodic-nova-python27-stable-grizzly/w…> (line 10))
Running setup.py egg_info for package routes
warning: no previously-included files matching '.DS_Store' found anywhere in distribution
warning: no previously-included files matching '*.hgignore' found anywhere in distribution
warning: no previously-included files matching '*.hgtags' found anywhere in distribution
Downloading/unpacking WebOb==1.2.3 (from -r <https://jenkins01.openstack.org/job/periodic-nova-python27-stable-grizzly/w…> (line 11))
Running setup.py egg_info for package WebOb
no previously-included directories found matching '*.pyc'
no previously-included directories found matching '*.pyo'
Downloading/unpacking greenlet>=0.3.1 (from -r <https://jenkins01.openstack.org/job/periodic-nova-python27-stable-grizzly/w…> (line 12))
Running setup.py egg_info for package greenlet
Downloading/unpacking PasteDeploy>=1.5.0 (from -r <https://jenkins01.openstack.org/job/periodic-nova-python27-stable-grizzly/w…> (line 13))
Downloading PasteDeploy-1.5.0.tar.gz
Running setup.py egg_info for package PasteDeploy
Downloading/unpacking paste (from -r <https://jenkins01.openstack.org/job/periodic-nova-python27-stable-grizzly/w…> (line 14))
Running setup.py egg_info for package paste
warning: no previously-included files matching '*' found under directory 'docs/_build/_sources'
Downloading/unpacking sqlalchemy-migrate>=0.7.2 (from -r <https://jenkins01.openstack.org/job/periodic-nova-python27-stable-grizzly/w…> (line 15))
Running setup.py egg_info for package sqlalchemy-migrate
warning: no files found matching '*' under directory 'tests'
warning: no previously-included files matching '*pyc' found anywhere in distribution
warning: no previously-included files found matching '.hgtags'
warning: no previously-included files matching '*' found under directory 'docs/_build'
Downloading/unpacking netaddr>=0.7.6 (from -r <https://jenkins01.openstack.org/job/periodic-nova-python27-stable-grizzly/w…> (line 16))
Could not find a version that satisfies the requirement netaddr>=0.7.6 (from -r <https://jenkins01.openstack.org/job/periodic-nova-python27-stable-grizzly/w…> (line 16)) (from versions: 0.7.1, 0.6.3, 0.6.2, 0.7.3, 0.7.3, 0.5, 0.6, 0.4, 0.6.4, 0.7.2, 0.6.1, 0.7.2, 0.5.1, 0.6.1, 0.6, 0.6.4, 0.5.2, 0.3.1, 0.7.1, 0.6.3, 0.5, 0.6.2, 0.3.1, 0.7, 0.7, 0.5.1, 0.4, 0.5.2, 0.7.4, 0.7.4, 0.7.3, 0.7.3, 0.7.2, 0.7.2, 0.7.1, 0.7.1, 0.7, 0.7, 0.6.4, 0.6.4, 0.6.3, 0.6.3, 0.6.2, 0.6.2, 0.6.1, 0.6.1, 0.6, 0.6, 0.5.2, 0.5.2, 0.5.1, 0.5.1, 0.5, 0.5, 0.4, 0.4, 0.3.1, 0.3.1, 0.3, 0.3, 0.2, 0.1)
Cleaning up...
No distributions matching the version for netaddr>=0.7.6 (from -r <https://jenkins01.openstack.org/job/periodic-nova-python27-stable-grizzly/w…> (line 16))
Storing complete log in <https://jenkins01.openstack.org/job/periodic-nova-python27-stable-grizzly/w…>
ERROR: could not install deps [-r<https://jenkins01.openstack.org/job/periodic-nova-python27-stable-grizzly/w…,> -r<https://jenkins01.openstack.org/job/periodic-nova-python27-stable-grizzly/w…]>
___________________________________ summary ____________________________________
ERROR: py27: could not install deps [-r<https://jenkins01.openstack.org/job/periodic-nova-python27-stable-grizzly/w…,> -r<https://jenkins01.openstack.org/job/periodic-nova-python27-stable-grizzly/w…]>
+ result=1
+ echo 'Begin pip freeze output from test virtualenv:'
Begin pip freeze output from test virtualenv:
+ echo ======================================================================
======================================================================
+ .tox/py27/bin/pip freeze
argparse==1.2.1
wsgiref==0.1.2
+ echo ======================================================================
======================================================================
+ '[' -d .testrepository ']'
+ sudo /usr/local/jenkins/slave_scripts/jenkins-sudo-grep.sh post
+ sudoresult=0
+ '[' 0 -ne 0 ']'
+ /usr/local/jenkins/slave_scripts/jenkins-oom-grep.sh post
+ oomresult=0
+ '[' 0 -ne 0 ']'
++ find . -name nose_results.html
+ htmlreport=
+ '[' -f '' ']'
+ echo
+ echo 'WARNING: Unable to find to confirm results!'
WARNING: Unable to find to confirm results!
+ echo
+ exit 1
+ rm -rf /tmp/tmp.fTYYvZUvnv
Build step 'Execute shell' marked build as failure
[SCP] Connecting to static.openstack.org
[SCP] No file(s) found: **/*nose_results.html
[SCP] '**/*nose_results.html' doesn't match anything: '**' exists but not '**/*nose_results.html'
[SCP] Connecting to static.openstack.org
[SCP] Trying to create /srv/static/logs/periodic/periodic-nova-python27-stable-grizzly/precise7/6
[SCP] Copying console log.
1
1
15 Aug '13
See <https://jenkins01.openstack.org/job/periodic-glance-python27-stable-grizzly…>
------------------------------------------
[...truncated 1166 lines...]
test_add_ignores_acls_if_no_locations [32mOK [0m[32m 0.00[0m
test_add_updates_acls [32mOK [0m[32m 0.00[0m
test_member_addition_updates_acls [32mOK [0m[32m 0.00[0m
test_member_removal_updates_acls [32mOK [0m[32m 0.00[0m
test_save_fetches_members_if_private [32mOK [0m[32m 0.00[0m
test_save_updates_acls [32mOK [0m[32m 0.00[0m
TestStoreLocation
test_bad_store_scheme [32mOK [0m[32m 0.01[0m
test_filesystem_store_location [32mOK [0m[32m 0.01[0m
test_get_location_from_uri_back_to_uri [32mOK [0m[32m 0.01[0m
test_get_store_from_scheme [32mOK [0m[32m 0.01[0m
test_http_store_location [32mOK [0m[32m 0.01[0m
test_rbd_store_location [32mOK [0m[32m 0.01[0m
test_s3_store_location [32mOK [0m[32m 0.01[0m
test_swift_store_location [32mOK [0m[32m 0.01[0m
TestChunkReader
test_read_all_data [32mOK [0m[32m 0.01[0m
TestCreatingLocations
test_multi_tenant_location [32mOK [0m[32m 0.01[0m
test_multi_tenant_location_custom_service_type [32mOK [0m[32m 0.01[0m
test_multi_tenant_location_http [32mOK [0m[32m 0.01[0m
test_multi_tenant_location_with_region [32mOK [0m[32m 0.01[0m
test_single_tenant_location [32mOK [0m[32m 0.01[0m
test_single_tenant_location_http [32mOK [0m[32m 0.01[0m
TestMultiTenantStoreConnections
test_basic_connection [32mOK [0m[32m 0.01[0m
test_connection_with_snet [32mOK [0m[32m 0.01[0m
TestSingleTenantStoreConnections
test_basic_connection [32mOK [0m[32m 0.01[0m
test_connection_invalid_user [32mOK [0m[32m 0.01[0m
test_connection_missing_user [32mOK [0m[32m 0.01[0m
test_connection_with_auth_v1 [32mOK [0m[32m 0.01[0m
test_connection_with_endpoint_type [32mOK [0m[32m 0.01[0m
test_connection_with_no_trailing_slash [32mOK [0m[32m 0.01[0m
test_connection_with_region [32mOK [0m[32m 0.01[0m
test_connection_with_service_type [32mOK [0m[32m 0.01[0m
test_connection_with_snet [32mOK [0m[32m 0.01[0m
TestStoreAuthV1
test_add [32mOK [0m[32m 0.01[0m
test_add_already_existing [32mOK [0m[32m 0.01[0m
test_add_auth_url_variations [32mOK [0m[32m 0.01[0m
test_add_large_object [32mOK [0m[32m 0.01[0m
test_add_large_object_zero_size [32mOK [0m[32m 0.01[0m
test_add_no_container_and_create [32mOK [0m[32m 0.01[0m
test_add_no_container_no_create [32mOK [0m[32m 0.01[0m
test_delete [32mOK [0m[32m 0.01[0m
test_delete_non_existing [32mOK [0m[32m 0.01[0m
test_get [32mOK [0m[32m 0.01[0m
test_get_non_existing [32mOK [0m[32m 0.01[0m
test_get_size [32mOK [0m[32m 0.00[0m
test_get_size_with_multi_tenant_on [32mOK [0m[32m 0.01[0m
test_get_with_http_auth [32mOK [0m[32m 0.01[0m
test_no_auth_address [32mOK [0m[32m 0.01[0m
test_no_key [32mOK [0m[32m 0.01[0m
test_no_user [32mOK [0m[32m 0.01[0m
test_read_acl_public [32mOK [0m[32m 0.01[0m
test_read_acl_tenants [32mOK [0m[32m 0.01[0m
test_read_write_public [32mOK [0m[32m 0.01[0m
TestStoreAuthV2
test_add [32mOK [0m[32m 0.01[0m
test_add_already_existing [32mOK [0m[32m 0.01[0m
test_add_auth_url_variations [32mOK [0m[32m 0.01[0m
test_add_large_object [32mOK [0m[32m 0.01[0m
test_add_large_object_zero_size [32mOK [0m[32m 0.01[0m
test_add_no_container_and_create [32mOK [0m[32m 0.01[0m
test_add_no_container_no_create [32mOK [0m[32m 0.01[0m
test_delete [32mOK [0m[32m 0.01[0m
test_delete_non_existing [32mOK [0m[32m 0.01[0m
test_get [32mOK [0m[32m 0.01[0m
test_get_non_existing [32mOK [0m[32m 0.01[0m
test_get_size [32mOK [0m[32m 0.00[0m
test_get_size_with_multi_tenant_on [32mOK [0m[32m 0.01[0m
test_get_with_http_auth [32mOK [0m[32m 0.01[0m
test_no_auth_address [32mOK [0m[32m 0.01[0m
test_no_key [32mOK [0m[32m 0.01[0m
test_no_user [32mOK [0m[32m 0.01[0m
test_read_acl_public [32mOK [0m[32m 0.01[0m
test_read_acl_tenants [32mOK [0m[32m 0.01[0m
test_read_write_public [32mOK [0m[32m 0.01[0m
test_v2_multi_tenant_location [32mOK [0m[32m 0.00[0m
test_v2_with_no_tenant [32mOK [0m[32m 0.01[0m
TestUtils
test_cooperative_reader [32mOK [0m[33m 0.04[0m
test_cooperative_reader_of_iterator [32mOK [0m[32m 0.00[0m
test_limiting_reader [32mOK [0m[32m 0.01[0m
test_limiting_reader_fails [32mOK [0m[32m 0.01[0m
VersionNegotiationTest
test_request_accept_v1 [32mOK [0m[32m 0.01[0m
test_request_url_v1 [32mOK [0m[32m 0.01[0m
test_request_url_v1_0 [32mOK [0m[32m 0.01[0m
test_request_url_v1_1 [32mOK [0m[32m 0.01[0m
test_request_url_v2 [32mOK [0m[32m 0.01[0m
test_request_url_v2_0 [32mOK [0m[32m 0.01[0m
test_request_url_v2_1 [32mOK [0m[32m 0.01[0m
test_request_url_v2_2_unsupported [32mOK [0m[32m 0.01[0m
test_request_url_v3_unsupported [32mOK [0m[32m 0.01[0m
VersionsTest
test_get_version_list [32mOK [0m[32m 0.01[0m
JSONRequestDeserializerTest
test_default_no_body [32mOK [0m[32m 0.00[0m
test_default_with_body [32mOK [0m[32m 0.00[0m
test_from_json [32mOK [0m[32m 0.00[0m
test_from_json_malformed [32mOK [0m[32m 0.00[0m
test_has_body_has_content_length [32mOK [0m[32m 0.00[0m
test_has_body_no_content_length [32mOK [0m[32m 0.00[0m
test_has_body_zero_content_length [32mOK [0m[32m 0.00[0m
test_no_body_no_content_length [32mOK [0m[32m 0.00[0m
JSONResponseSerializerTest
test_default [32mOK [0m[32m 0.00[0m
test_to_json [32mOK [0m[32m 0.00[0m
RequestTest
test_content_type_accept_default [32mOK [0m[32m 0.00[0m
test_content_type_from_accept_json [32mOK [0m[32m 0.00[0m
test_content_type_from_accept_json_xml_quality [32mOK [0m[32m 0.00[0m
test_content_type_from_accept_xml [32mOK [0m[32m 0.00[0m
test_content_type_from_accept_xml_json [32mOK [0m[32m 0.00[0m
test_content_type_missing [32mOK [0m[32m 0.00[0m
test_content_type_unsupported [32mOK [0m[32m 0.00[0m
test_content_type_with_charset [32mOK [0m[32m 0.00[0m
ResourceTest
test_dispatch [32mOK [0m[32m 0.00[0m
test_dispatch_default [32mOK [0m[32m 0.00[0m
test_dispatch_no_default [32mOK [0m[32m 0.00[0m
test_get_action_args [32mOK [0m[32m 0.00[0m
TestHelpers
test_data_passed_properly_through_headers [32mOK [0m[32m 0.00[0m
test_headers_are_unicode [32mOK [0m[32m 0.00[0m
======================================================================
ERROR: glance.tests.functional.test_logging.TestLogging.test_logrotate
----------------------------------------------------------------------
_StringException: Traceback (most recent call last):
File "<https://jenkins01.openstack.org/job/periodic-glance-python27-stable-grizzly…",> line 95, in test_logrotate
response, content = httplib2.Http().request(path, 'GET')
File "<https://jenkins01.openstack.org/job/periodic-glance-python27-stable-grizzly…",> line 1570, in request
(response, content) = self._request(conn, authority, uri, request_uri, method, body, headers, redirections, cachekey)
File "<https://jenkins01.openstack.org/job/periodic-glance-python27-stable-grizzly…",> line 1317, in _request
(response, content) = self._conn_request(conn, request_uri, method, body, headers)
File "<https://jenkins01.openstack.org/job/periodic-glance-python27-stable-grizzly…",> line 1252, in _conn_request
conn.connect()
File "<https://jenkins01.openstack.org/job/periodic-glance-python27-stable-grizzly…",> line 913, in connect
raise socket.error, msg
error: [Errno 111] ECONNREFUSED
----------------------------------------------------------------------
XML: nosetests.xml
Slowest 5 tests took 88.33 secs:
[31m 25.71 TestScrubber.test_scrubber_app[0m
[31m 20.13 TestScrubber.test_delayed_delete[0m
[31m 14.43 TestGlanceControl.test_reload[0m
[31m 14.16 TestGlanceControl.test_respawn[0m
[31m 13.90 TestGlanceControl.test_bouncing[0m
----------------------------------------------------------------------
Ran 1101 tests in 556.506s
FAILED (SKIP=38, errors=1)
ERROR: InvocationError: '<https://jenkins01.openstack.org/job/periodic-glance-python27-stable-grizzly…'>
___________________________________ summary ____________________________________
ERROR: py27: commands failed
+ result=1
+ echo 'Begin pip freeze output from test virtualenv:'
Begin pip freeze output from test virtualenv:
+ echo ======================================================================
======================================================================
+ .tox/py27/bin/pip freeze
Babel==1.3
Jinja2==2.7.1
MarkupSafe==0.18
MySQL-python==1.2.4
Paste==1.7.5.1
PasteDeploy==1.5.0
Pygments==1.6
Routes==1.13
SQLAlchemy==0.7.9
Sphinx==1.1.3
Tempita==0.5.1
WebOb==1.2.3
amqp==1.0.13
anyjson==0.3.3
argparse==1.2.1
boto==2.10.0
cffi==0.7.2
colorama==0.2.5
coverage==3.6
d2to1==0.2.10
decorator==3.4.0
distribute==0.7.3
docutils==0.10
eventlet==0.13.0
extras==0.0.3
fixtures==0.3.12
glance==jenkins.periodic.glance.python27.stable.grizzly.4
greenlet==0.4.1
httplib2==0.8
iso8601==0.1.4
jsonschema==2.0.0
kombu==2.5.12
lxml==3.2.3
mox==0.5.3
nose==1.3.0
nose-exclude==0.1.10
nosehtmloutput==0.0.5
openstack.nose-plugin==0.11
oslo.config==1.1.1
passlib==1.6.1
pbr==0.5.21
pep8==1.3.3
prettytable==0.7.2
psycopg2==2.5.1
pycparser==2.10
pycrypto==2.6
pysendfile==2.0.0
python-keystoneclient==0.3.1
python-mimeparse==0.1.4
python-swiftclient==1.5.0
pytz==2013b
repoze.lru==0.6
requests==1.2.3
simplejson==3.3.0
six==1.3.0
sqlalchemy-migrate==0.7.2
termcolor==1.1.0
testtools==0.9.32
wsgiref==0.1.2
xattr==0.7.2
+ echo ======================================================================
======================================================================
+ '[' -d .testrepository ']'
+ sudo /usr/local/jenkins/slave_scripts/jenkins-sudo-grep.sh post
+ sudoresult=0
+ '[' 0 -ne 0 ']'
+ /usr/local/jenkins/slave_scripts/jenkins-oom-grep.sh post
+ oomresult=0
+ '[' 0 -ne 0 ']'
++ find . -name nose_results.html
+ htmlreport=./nose_results.html
+ '[' -f ./nose_results.html ']'
++ grep -c 'tr class=.passClass' ./nose_results.html
+ passcount=126
+ '[' 126 -eq 0 ']'
+ exit 1
+ rm -rf /tmp/tmp.Xlk8djfOZp
Build step 'Execute shell' marked build as failure
[SCP] Connecting to static.openstack.org
[SCP] uploading file: '/srv/static/logs/periodic/periodic-glance-python27-stable-grizzly/4/nose_results.html'
[SCP] Connecting to static.openstack.org
[SCP] Trying to create /srv/static/logs/periodic/periodic-glance-python27-stable-grizzly/precise5/4
[SCP] Copying console log.
1
1
14 Aug '13
See <https://jenkins02.openstack.org/job/periodic-glance-python27-stable-folsom/…>
------------------------------------------
[...truncated 949 lines...]
test_calling_format_subdomain [32mOK [0m[32m 0.01[0m
test_delete [32mOK [0m[32m 0.01[0m
test_delete_non_existing [32mOK [0m[32m 0.01[0m
test_get [32mOK [0m[32m 0.01[0m
test_get_calling_format_default [32mOK [0m[32m 0.01[0m
test_get_calling_format_path [32mOK [0m[32m 0.01[0m
test_get_non_existing [32mOK [0m[32m 0.01[0m
test_get_s3_bad_location [32mOK [0m[32m 0.01[0m
test_get_s3_good_location [32mOK [0m[32m 0.01[0m
test_no_access_key [32mOK [0m[32m 0.01[0m
test_no_host [32mOK [0m[32m 0.01[0m
test_no_secret_key [32mOK [0m[32m 0.01[0m
TestBasicSchema
test_filter_strips_extra_properties [32mOK [0m[32m 0.01[0m
test_merge_conflicting_but_identical_properties [32mOK [0m[32m 0.01[0m
test_merge_conflicting_properties [32mOK [0m[32m 0.01[0m
test_merge_properties [32mOK [0m[32m 0.01[0m
test_raw_json_schema [32mOK [0m[32m 0.01[0m
test_validate_fails_on_bad_type [32mOK [0m[32m 0.01[0m
test_validate_fails_on_extra_properties [32mOK [0m[32m 0.01[0m
test_validate_passes [32mOK [0m[32m 0.01[0m
TestBasicSchemaLinks
test_raw_json_schema [32mOK [0m[32m 0.01[0m
TestCollectionSchema
test_raw_json_schema [32mOK [0m[32m 0.01[0m
TestPermissiveSchema
test_filter_passes_extra_properties [32mOK [0m[32m 0.01[0m
test_raw_json_schema [32mOK [0m[32m 0.01[0m
test_validate_rejects_non_string_extra_properties [32mOK [0m[32m 0.01[0m
test_validate_with_additional_properties_allowed [32mOK [0m[32m 0.01[0m
TestSkipExamples
test_001_increase_test_counter [32mOK [0m[32m 0.01[0m
test_002_increase_test_counter [32mOK [0m[32m 0.01[0m
test_003_verify_test_counter [32mOK [0m[32m 0.01[0m
test_skip_if_example [34mSKIP[0m
test_skip_test_example [34mSKIP[0m
test_skip_unless_example [34mSKIP[0m
TestStoreLocation
test_bad_store_scheme [32mOK [0m[32m 0.01[0m
test_filesystem_store_location [32mOK [0m[32m 0.01[0m
test_get_location_from_uri_back_to_uri [32mOK [0m[32m 0.01[0m
test_get_store_from_scheme [32mOK [0m[32m 0.01[0m
test_http_store_location [32mOK [0m[32m 0.01[0m
test_rbd_store_location [32mOK [0m[32m 0.01[0m
test_s3_store_location [32mOK [0m[32m 0.01[0m
test_swift_store_location [32mOK [0m[32m 0.01[0m
TestChunkReader
test_read_all_data [32mOK [0m[32m 0.01[0m
TestStoreAuthV1
test_add [32mOK [0m[32m 0.01[0m
test_add_already_existing [32mOK [0m[32m 0.01[0m
test_add_auth_url_variations [32mOK [0m[32m 0.02[0m
test_add_large_object [32mOK [0m[32m 0.01[0m
test_add_large_object_zero_size [32mOK [0m[32m 0.01[0m
test_add_no_container_and_create [32mOK [0m[32m 0.01[0m
test_add_no_container_no_create [32mOK [0m[32m 0.01[0m
test_delete [32mOK [0m[32m 0.01[0m
test_delete_non_existing [32mOK [0m[32m 0.01[0m
test_get [32mOK [0m[32m 0.01[0m
test_get_non_existing [32mOK [0m[32m 0.01[0m
test_get_size [32mOK [0m[32m 0.01[0m
test_get_with_http_auth [32mOK [0m[32m 0.01[0m
test_no_auth_address [32mOK [0m[32m 0.01[0m
test_no_key [32mOK [0m[32m 0.01[0m
test_no_user [32mOK [0m[32m 0.01[0m
test_read_acl_public [32mOK [0m[32m 0.01[0m
test_read_acl_tenants [32mOK [0m[32m 0.01[0m
test_read_write_public [32mOK [0m[32m 0.01[0m
TestStoreAuthV2
test_add [32mOK [0m[32m 0.01[0m
test_add_already_existing [32mOK [0m[32m 0.01[0m
test_add_auth_url_variations [32mOK [0m[32m 0.02[0m
test_add_large_object [32mOK [0m[32m 0.01[0m
test_add_large_object_zero_size [32mOK [0m[32m 0.01[0m
test_add_no_container_and_create [32mOK [0m[32m 0.01[0m
test_add_no_container_no_create [32mOK [0m[32m 0.01[0m
test_delete [32mOK [0m[32m 0.01[0m
test_delete_non_existing [32mOK [0m[32m 0.01[0m
test_get [32mOK [0m[32m 0.01[0m
test_get_non_existing [32mOK [0m[32m 0.01[0m
test_get_size [32mOK [0m[32m 0.01[0m
test_get_with_http_auth [32mOK [0m[32m 0.01[0m
test_no_auth_address [32mOK [0m[32m 0.01[0m
test_no_key [32mOK [0m[32m 0.01[0m
test_no_user [32mOK [0m[32m 0.01[0m
test_read_acl_public [32mOK [0m[32m 0.01[0m
test_read_acl_tenants [32mOK [0m[32m 0.01[0m
test_read_write_public [32mOK [0m[32m 0.01[0m
test_v2_multi_tenant_location [32mOK [0m[32m 0.01[0m
test_v2_with_no_tenant [32mOK [0m[32m 0.01[0m
TestUtils
test_cooperative_reader [32mOK [0m[33m 0.04[0m
test_cooperative_reader_of_iterator [32mOK [0m[32m 0.01[0m
test_generate_uuid_format [32mOK [0m[32m 0.01[0m
test_generate_uuid_unique [32mOK [0m[32m 0.01[0m
test_is_uuid_like_fails [32mOK [0m[32m 0.01[0m
test_is_uuid_like_success [32mOK [0m[32m 0.01[0m
test_limiting_reader [32mOK [0m[32m 0.01[0m
test_limiting_reader_fails [32mOK [0m[32m 0.01[0m
VersionNegotiationTest
test_request_accept_v1 [32mOK [0m[32m 0.01[0m
test_request_url_v1 [32mOK [0m[32m 0.01[0m
test_request_url_v1_0 [32mOK [0m[32m 0.01[0m
test_request_url_v1_1 [32mOK [0m[32m 0.01[0m
test_request_url_v2 [32mOK [0m[32m 0.01[0m
test_request_url_v2_0 [32mOK [0m[32m 0.02[0m
test_request_url_v2_1_unsupported [32mOK [0m[32m 0.01[0m
test_request_url_v3_unsupported [32mOK [0m[32m 0.01[0m
VersionsTest
test_get_version_list [32mOK [0m[32m 0.01[0m
JSONRequestDeserializerTest
test_default_no_body [32mOK [0m[32m 0.01[0m
test_default_with_body [32mOK [0m[32m 0.01[0m
test_from_json [32mOK [0m[32m 0.01[0m
test_from_json_malformed [32mOK [0m[32m 0.01[0m
test_has_body_has_content_length [32mOK [0m[32m 0.01[0m
test_has_body_no_content_length [32mOK [0m[32m 0.01[0m
test_has_body_zero_content_length [32mOK [0m[32m 0.01[0m
test_no_body_no_content_length [32mOK [0m[32m 0.01[0m
JSONResponseSerializerTest
test_default [32mOK [0m[32m 0.01[0m
test_to_json [32mOK [0m[32m 0.01[0m
RequestTest
test_content_type_accept_default [32mOK [0m[32m 0.01[0m
test_content_type_from_accept_json [32mOK [0m[32m 0.01[0m
test_content_type_from_accept_json_xml_quality [32mOK [0m[32m 0.01[0m
test_content_type_from_accept_xml [32mOK [0m[32m 0.01[0m
test_content_type_from_accept_xml_json [32mOK [0m[32m 0.01[0m
test_content_type_missing [32mOK [0m[32m 0.01[0m
test_content_type_unsupported [32mOK [0m[32m 0.01[0m
test_content_type_with_charset [32mOK [0m[32m 0.01[0m
ResourceTest
test_dispatch [32mOK [0m[32m 0.01[0m
test_dispatch_default [32mOK [0m[32m 0.01[0m
test_dispatch_no_default [32mOK [0m[32m 0.01[0m
test_get_action_args [32mOK [0m[32m 0.01[0m
TestHelpers
test_data_passed_properly_through_headers [32mOK [0m[32m 0.01[0m
test_headers_are_unicode [32mOK [0m[32m 0.01[0m
======================================================================
FAIL: Test that we notice when our log file has been rotated
----------------------------------------------------------------------
Traceback (most recent call last):
File "<https://jenkins02.openstack.org/job/periodic-glance-python27-stable-folsom/…",> line 90, in test_logrotate
self.assertNotEmptyFile(self.api_server.log_file)
File "<https://jenkins02.openstack.org/job/periodic-glance-python27-stable-folsom/…",> line 80, in assertNotEmptyFile
self.assertTrue(os.path.exists(path))
AssertionError: False is not true
'False is not true' = self._formatMessage('False is not true', "%s is not true" % safe_repr(False))
>> raise self.failureException('False is not true')
----------------------------------------------------------------------
XML: nosetests.xml
Slowest 5 tests took 172.68 secs:
[31m 85.44 TestGlanceControl.test_bouncing[0m
[31m 23.98 TestBinGlanceCacheManage.test_queue[0m
[31m 22.51 TestBinGlance.test_results_filtering[0m
[31m 21.76 TestRootApi.test_version_configurations[0m
[31m 18.99 TestScrubber.test_delayed_delete[0m
----------------------------------------------------------------------
Ran 926 tests in 997.642s
FAILED (SKIP=89, failures=1)
ERROR: InvocationError: '<https://jenkins02.openstack.org/job/periodic-glance-python27-stable-folsom/…'>
___________________________________ summary ____________________________________
ERROR: py27: commands failed
+ result=1
+ echo 'Begin pip freeze output from test virtualenv:'
Begin pip freeze output from test virtualenv:
+ echo ======================================================================
======================================================================
+ .tox/py27/bin/pip freeze
Babel==1.3
Jinja2==2.7.1
MarkupSafe==0.18
Paste==1.7.5.1
PasteDeploy==1.5.0
Pygments==1.6
Routes==1.13
SQLAlchemy==0.7.9
Sphinx==1.1.3
Tempita==0.5.1
WebOb==1.0.8
amqp==1.0.13
anyjson==0.3.3
argparse==1.2.1
boto==2.1.1
cffi==0.7.2
colorama==0.2.5
coverage==3.6
d2to1==0.2.10
decorator==3.4.0
distribute==0.7.3
docutils==0.10
eventlet==0.13.0
glance==jenkins-periodic-glance-python27-stable-folsom-6
greenlet==0.4.1
httplib2==0.8
iso8601==0.1.4
jsonschema==2.0.0
kombu==2.5.12
lxml==3.2.3
mox==0.5.3
nose==1.3.0
nose-exclude==0.1.10
nosehtmloutput==0.0.5
openstack.nose-plugin==0.11
passlib==1.6.1
pbr==0.5.21
pep8==1.1
pycparser==2.10
pycrypto==2.6
pysendfile==2.0.0
python-swiftclient==1.5.0
pytz==2013b
repoze.lru==0.6
requests==1.2.3
simplejson==3.3.0
sqlalchemy-migrate==0.7.2
termcolor==1.1.0
wsgiref==0.1.2
xattr==0.7.2
+ echo ======================================================================
======================================================================
+ '[' -d .testrepository ']'
+ sudo /usr/local/jenkins/slave_scripts/jenkins-sudo-grep.sh post
+ sudoresult=0
+ '[' 0 -ne 0 ']'
+ /usr/local/jenkins/slave_scripts/jenkins-oom-grep.sh post
+ oomresult=0
+ '[' 0 -ne 0 ']'
++ find . -name nose_results.html
+ htmlreport=./nose_results.html
+ '[' -f ./nose_results.html ']'
++ grep -c 'tr class=.passClass' ./nose_results.html
+ passcount=94
+ '[' 94 -eq 0 ']'
+ exit 1
+ rm -rf /tmp/tmp.QBsqWGSa6w
Build step 'Execute shell' marked build as failure
[SCP] Connecting to static.openstack.org
[SCP] Trying to create /srv/static/logs/periodic/periodic-glance-python27-stable-folsom/6
[SCP] uploading file: '/srv/static/logs/periodic/periodic-glance-python27-stable-folsom/6/nose_results.html'
[SCP] Connecting to static.openstack.org
[SCP] Trying to create /srv/static/logs/periodic/periodic-glance-python27-stable-folsom/precise6
[SCP] Trying to create /srv/static/logs/periodic/periodic-glance-python27-stable-folsom/precise6/6
[SCP] Copying console log.
1
1
14 Aug '13
See <https://jenkins02.openstack.org/job/periodic-heat-python27-stable-grizzly/6/>
------------------------------------------
[...truncated 643 lines...]
test_describe_stack_resources (heat.tests.test_rpc_client.EngineRpcAPITestCase) ... ok
test_find_physical_resource (heat.tests.test_rpc_client.EngineRpcAPITestCase) ... ok
test_get_template (heat.tests.test_rpc_client.EngineRpcAPITestCase) ... ok
test_list_events (heat.tests.test_rpc_client.EngineRpcAPITestCase) ... ok
test_list_stack_resources (heat.tests.test_rpc_client.EngineRpcAPITestCase) ... ok
test_metadata_update (heat.tests.test_rpc_client.EngineRpcAPITestCase) ... ok
test_set_watch_state (heat.tests.test_rpc_client.EngineRpcAPITestCase) ... ok
test_show_stack (heat.tests.test_rpc_client.EngineRpcAPITestCase) ... ok
test_show_watch (heat.tests.test_rpc_client.EngineRpcAPITestCase) ... ok
test_show_watch_metric (heat.tests.test_rpc_client.EngineRpcAPITestCase) ... ok
test_update_stack (heat.tests.test_rpc_client.EngineRpcAPITestCase) ... ok
test_validate_template (heat.tests.test_rpc_client.EngineRpcAPITestCase) ... ok
test_attributes (heat.tests.test_s3.s3Test) ... ok
test_authenticated_read (heat.tests.test_s3.s3Test) ... ok
test_create_container_name (heat.tests.test_s3.s3Test) ... ok
test_delete_exception (heat.tests.test_s3.s3Test) ... ok
test_delete_retain (heat.tests.test_s3.s3Test) ... ok
test_public_read (heat.tests.test_s3.s3Test) ... ok
test_public_read_write (heat.tests.test_s3.s3Test) ... ok
test_website (heat.tests.test_s3.s3Test) ... ok
test_security_group_nova (heat.tests.test_security_group.SecurityGroupTest) ... ok
test_security_group_nova_exception (heat.tests.test_security_group.SecurityGroupTest) ... ok
test_byte_string_12 (heat.tests.test_short_id.ShortIdTest) ... ok
test_byte_string_16 (heat.tests.test_short_id.ShortIdTest) ... ok
test_byte_string_60 (heat.tests.test_short_id.ShortIdTest) ... ok
test_byte_string_8 (heat.tests.test_short_id.ShortIdTest) ... ok
test_generate_ids (heat.tests.test_short_id.ShortIdTest) ... ok
test_get_id_string (heat.tests.test_short_id.ShortIdTest) ... ok
test_get_id_uuid1 (heat.tests.test_short_id.ShortIdTest) ... ok
test_get_id_uuid_0 (heat.tests.test_short_id.ShortIdTest) ... ok
test_get_id_uuid_1 (heat.tests.test_short_id.ShortIdTest) ... ok
test_get_id_uuid_endianness (heat.tests.test_short_id.ShortIdTest) ... ok
test_get_id_uuid_f (heat.tests.test_short_id.ShortIdTest) ... ok
test_attributes (heat.tests.test_swift.swiftTest) ... ok
test_build_meta_headers (heat.tests.test_swift.swiftTest) ... ok
test_create_container_name (heat.tests.test_swift.swiftTest) ... ok
test_delete_exception (heat.tests.test_swift.swiftTest) ... ok
test_delete_retain (heat.tests.test_swift.swiftTest) ... ok
test_public_read (heat.tests.test_swift.swiftTest) ... ok
test_public_read_write (heat.tests.test_swift.swiftTest) ... ok
test_website (heat.tests.test_swift.swiftTest) ... ok
test_convert_all_templates (heat.tests.test_template_format.JsonToYamlTest) ... ok
test_quantum_resolved (heat.tests.test_template_format.JsonYamlResolvedCompareTest) ... ok
test_wordpress_resolved (heat.tests.test_template_format.JsonYamlResolvedCompareTest) ... ok
test_minimal_yaml (heat.tests.test_template_format.YamlMinimalTest) ... ok
test_file_scheme (heat.tests.test_urlfetch.UrlFetchTest) ... ok
test_garbage (heat.tests.test_urlfetch.UrlFetchTest) ... ok
test_http_error (heat.tests.test_urlfetch.UrlFetchTest) ... ok
test_http_scheme (heat.tests.test_urlfetch.UrlFetchTest) ... ok
test_https_scheme (heat.tests.test_urlfetch.UrlFetchTest) ... ok
test_access_key (heat.tests.test_user.AccessKeyTest) ... ok
test_access_key_no_user (heat.tests.test_user.AccessKeyTest) ... ok
test_accesspolicy_access_allowed (heat.tests.test_user.AccessPolicyTest) ... ok
test_accesspolicy_create_err_notfound (heat.tests.test_user.AccessPolicyTest) ... ok
test_accesspolicy_create_ok (heat.tests.test_user.AccessPolicyTest) ... ok
test_accesspolicy_create_ok_empty (heat.tests.test_user.AccessPolicyTest) ... ok
test_accesspolicy_update (heat.tests.test_user.AccessPolicyTest) ... ok
test_user (heat.tests.test_user.UserTest) ... ok
test_user_access_allowed (heat.tests.test_user.UserTest) ... ok
test_user_access_allowed_ignorepolicy (heat.tests.test_user.UserTest) ... ok
test_user_create_bad_policies (heat.tests.test_user.UserTest) ... ok
test_user_validate_policies (heat.tests.test_user.UserTest) ... ok
test_validate_findinmap_invalid (heat.tests.test_validate.validateTest) ... ok
test_validate_findinmap_valid (heat.tests.test_validate.validateTest) ... ok
test_validate_ref_invalid (heat.tests.test_validate.validateTest) ... ok
test_validate_ref_valid (heat.tests.test_validate.validateTest) ... ok
test_validate_volumeattach_invalid (heat.tests.test_validate.validateTest) ... ok
test_validate_volumeattach_valid (heat.tests.test_validate.validateTest) ... ok
test_volume (heat.tests.test_volume.VolumeTest) ... ok
test_volume_attachment (heat.tests.test_volume.VolumeTest) ... ok
test_volume_attachment_error (heat.tests.test_volume.VolumeTest) ... ok
test_volume_create_error (heat.tests.test_volume.VolumeTest) ... ok
test_internet_gateway (heat.tests.test_vpc.InternetGatewayTest) ... ok
test_network_interface (heat.tests.test_vpc.NetworkInterfaceTest) ... ok
test_route_table (heat.tests.test_vpc.RouteTableTest) ... ok
test_subnet (heat.tests.test_vpc.SubnetTest) ... ok
test_vpc (heat.tests.test_vpc.VPCTest) ... ok
test_get_status (heat.tests.test_waitcondition.WaitConditionHandleTest) ... ok
test_get_status_reason (heat.tests.test_waitcondition.WaitConditionHandleTest) ... ok
test_handle (heat.tests.test_waitcondition.WaitConditionHandleTest) ... ok
test_metadata_update (heat.tests.test_waitcondition.WaitConditionHandleTest) ... ok
test_metadata_update_invalid (heat.tests.test_waitcondition.WaitConditionHandleTest) ... ok
test_FnGetAtt (heat.tests.test_waitcondition.WaitConditionTest) ... ok
test_post_failure_to_handle (heat.tests.test_waitcondition.WaitConditionTest) ... ok
test_post_failure_to_handle_count (heat.tests.test_waitcondition.WaitConditionTest) ... ok
test_post_success_to_handle (heat.tests.test_waitcondition.WaitConditionTest) ... ok
test_post_success_to_handle_count (heat.tests.test_waitcondition.WaitConditionTest) ... ok
test_timeout (heat.tests.test_waitcondition.WaitConditionTest) ... ok
test_validate_handle_url_bad_resource (heat.tests.test_waitcondition.WaitConditionTest) ... ok
test_validate_handle_url_bad_resource_type (heat.tests.test_waitcondition.WaitConditionTest) ... ok
test_validate_handle_url_bad_stackid (heat.tests.test_waitcondition.WaitConditionTest) ... ok
test_validate_handle_url_bad_stackname (heat.tests.test_waitcondition.WaitConditionTest) ... ok
test_validate_handle_url_bad_tenant (heat.tests.test_waitcondition.WaitConditionTest) ... ok
test_ave (heat.tests.test_watch.WatchRuleTest) ... ok
test_create_watch_data (heat.tests.test_watch.WatchRuleTest) ... ok
test_evaluate (heat.tests.test_watch.WatchRuleTest) ... ok
test_load (heat.tests.test_watch.WatchRuleTest) ... ok
test_maximum (heat.tests.test_watch.WatchRuleTest) ... ok
test_minimum (heat.tests.test_watch.WatchRuleTest) ... ok
test_rule_actions_alarm_alarm (heat.tests.test_watch.WatchRuleTest) ... ok
test_rule_actions_alarm_normal (heat.tests.test_watch.WatchRuleTest) ... ok
test_rule_actions_alarm_two_actions (heat.tests.test_watch.WatchRuleTest) ... ok
test_rule_actions_nodata (heat.tests.test_watch.WatchRuleTest) ... ok
test_rule_actions_ok_alarm (heat.tests.test_watch.WatchRuleTest) ... ok
test_samplecount (heat.tests.test_watch.WatchRuleTest) ... ok
test_set_watch_state (heat.tests.test_watch.WatchRuleTest) ... ok
test_set_watch_state_invalid (heat.tests.test_watch.WatchRuleTest) ... ok
test_store (heat.tests.test_watch.WatchRuleTest) ... ok
test_sum (heat.tests.test_watch.WatchRuleTest) ... ok
======================================================================
FAIL: test_FnGetAtt (heat.tests.test_metadata_refresh.MetadataRefreshTest)
----------------------------------------------------------------------
Traceback (most recent call last):
File "<https://jenkins02.openstack.org/job/periodic-heat-python27-stable-grizzly/w…",> line 75, in wrapped_test
test_fn(test_cls)
File "<https://jenkins02.openstack.org/job/periodic-heat-python27-stable-grizzly/w…",> line 176, in test_FnGetAtt
self.assertEqual(s2.CREATE_COMPLETE, s2.state)
AssertionError: 'CREATE_COMPLETE' != 'CREATE_FAILED'
-------------------- >> begin captured stdout << ---------------------
Running test test_FnGetAtt
--------------------- >> end captured stdout << ----------------------
"'CREATE_COMPLETE' != 'CREATE_FAILED'" = '%s != %s' % (safe_repr('CREATE_COMPLETE'), safe_repr('CREATE_FAILED'))
"'CREATE_COMPLETE' != 'CREATE_FAILED'" = self._formatMessage("'CREATE_COMPLETE' != 'CREATE_FAILED'", "'CREATE_COMPLETE' != 'CREATE_FAILED'")
>> raise self.failureException("'CREATE_COMPLETE' != 'CREATE_FAILED'")
-------------------- >> begin captured logging << --------------------
heat.engine.resource: INFO: creating Instance "S1"
heat.engine.resource: INFO: creating Instance "S2"
heat.engine.resource: ERROR: create Instance "S2"
Traceback (most recent call last):
File "<https://jenkins02.openstack.org/job/periodic-heat-python27-stable-grizzly/w…",> line 320, in create
self.handle_create()
File "<https://jenkins02.openstack.org/job/periodic-heat-python27-stable-grizzly/w…",> line 765, in __call__
return mock_method(*params, **named_params)
File "<https://jenkins02.openstack.org/job/periodic-heat-python27-stable-grizzly/w…",> line 1002, in __call__
expected_method = self._VerifyMethodCall()
File "<https://jenkins02.openstack.org/job/periodic-heat-python27-stable-grizzly/w…",> line 1049, in _VerifyMethodCall
expected = self._PopNextMethod()
File "<https://jenkins02.openstack.org/job/periodic-heat-python27-stable-grizzly/w…",> line 1035, in _PopNextMethod
raise UnexpectedMethodCallError(self, None)
UnexpectedMethodCallError: Unexpected method call handle_create.__call__() -> None
heat.engine.resource: INFO: deleting Instance "S1" (inst:None db_id:12)
--------------------- >> end captured logging << ---------------------
----------------------------------------------------------------------
XML: nosetests.xml
----------------------------------------------------------------------
Ran 694 tests in 13.516s
FAILED (failures=1)
ERROR: InvocationError: '<https://jenkins02.openstack.org/job/periodic-heat-python27-stable-grizzly/w…> -a tag=unit'
___________________________________ summary ____________________________________
ERROR: py27: commands failed
+ result=1
+ echo 'Begin pip freeze output from test virtualenv:'
Begin pip freeze output from test virtualenv:
+ echo ======================================================================
======================================================================
+ .tox/py27/bin/pip freeze
Babel==1.3
Jinja2==2.7.1
MarkupSafe==0.18
PasteDeploy==1.5.0
PyYAML==3.10
Pygments==1.6
Routes==1.12.3
SQLAlchemy==0.7.10
Sphinx==1.1.3
Tempita==0.5.1
WebOb==1.2.3
amqp==1.0.13
anyjson==0.3.3
argparse==1.2.1
boto==2.9.9
cliff==1.4
cmd2==0.6.6
colorama==0.2.5
coverage==3.6
d2to1==0.2.10
decorator==3.4.0
distribute==0.7.3
docutils==0.10
eventlet==0.13.0
greenlet==0.4.1
heat==jenkins.periodic.heat.python27.stable.grizzly.6
httplib2==0.8
iso8601==0.1.4
jsonpatch==1.1
jsonpointer==1.0
jsonschema==2.0.0
kombu==2.5.12
lxml==2.3.5
mox==0.5.3
nose==1.3.0
nosexcover==1.0.8
openstack.nose-plugin==0.11
oslo.config==1.1.1
paramiko==1.11.0
pbr==0.5.21
pep8==1.3.4
prettytable==0.7.2
pyOpenSSL==0.13
pycrypto==2.6
pyflakes==0.7.3
pyparsing==1.5.7
python-cinderclient==1.0.5
python-glanceclient==0.10.0
python-keystoneclient==0.3.1
python-memcached==1.53
python-novaclient==2.14.1
python-quantumclient==2.2.3
python-swiftclient==1.5.0
pytz==2013b
requests==1.2.3
simplejson==3.3.0
six==1.3.0
sqlalchemy-migrate==0.7.2
termcolor==1.1.0
warlock==1.0.1
wsgiref==0.1.2
+ echo ======================================================================
======================================================================
+ '[' -d .testrepository ']'
+ sudo /usr/local/jenkins/slave_scripts/jenkins-sudo-grep.sh post
+ sudoresult=0
+ '[' 0 -ne 0 ']'
+ /usr/local/jenkins/slave_scripts/jenkins-oom-grep.sh post
+ oomresult=0
+ '[' 0 -ne 0 ']'
++ find . -name nose_results.html
+ htmlreport=
+ '[' -f '' ']'
+ echo
+ echo 'WARNING: Unable to find to confirm results!'
WARNING: Unable to find to confirm results!
+ echo
+ exit 1
+ rm -rf /tmp/tmp.D8XkvQsTyW
Build step 'Execute shell' marked build as failure
[SCP] Connecting to static.openstack.org
[SCP] No file(s) found: **/*nose_results.html
[SCP] '**/*nose_results.html' doesn't match anything: '**' exists but not '**/*nose_results.html'
[SCP] Connecting to static.openstack.org
[SCP] Trying to create /srv/static/logs/periodic/periodic-heat-python27-stable-grizzly/precise12/6
[SCP] Copying console log.
1
1
13 Aug '13
See <https://jenkins01.openstack.org/job/periodic-glance-python26-stable-folsom/…>
------------------------------------------
[...truncated 951 lines...]
test_delete_non_existing [32mOK [0m[32m 0.02[0m
test_get [32mOK [0m[32m 0.01[0m
test_get_calling_format_default [32mOK [0m[32m 0.02[0m
test_get_calling_format_path [32mOK [0m[32m 0.02[0m
test_get_non_existing [32mOK [0m[32m 0.01[0m
test_get_s3_bad_location [32mOK [0m[32m 0.01[0m
test_get_s3_good_location [32mOK [0m[32m 0.01[0m
test_no_access_key [32mOK [0m[32m 0.01[0m
test_no_host [32mOK [0m[32m 0.01[0m
test_no_secret_key [32mOK [0m[32m 0.01[0m
TestBasicSchema
test_filter_strips_extra_properties [32mOK [0m[32m 0.01[0m
test_merge_conflicting_but_identical_properties [32mOK [0m[32m 0.01[0m
test_merge_conflicting_properties [32mOK [0m[32m 0.01[0m
test_merge_properties [32mOK [0m[32m 0.01[0m
test_raw_json_schema [32mOK [0m[32m 0.01[0m
test_validate_fails_on_bad_type [32mOK [0m[32m 0.01[0m
test_validate_fails_on_extra_properties [32mOK [0m[32m 0.01[0m
test_validate_passes [32mOK [0m[32m 0.01[0m
TestBasicSchemaLinks
test_raw_json_schema [32mOK [0m[32m 0.01[0m
TestCollectionSchema
test_raw_json_schema [32mOK [0m[32m 0.01[0m
TestPermissiveSchema
test_filter_passes_extra_properties [32mOK [0m[32m 0.01[0m
test_raw_json_schema [32mOK [0m[32m 0.01[0m
test_validate_rejects_non_string_extra_properties [32mOK [0m[32m 0.01[0m
test_validate_with_additional_properties_allowed [32mOK [0m[32m 0.01[0m
TestSkipExamples
test_001_increase_test_counter [32mOK [0m[32m 0.01[0m
test_002_increase_test_counter [32mOK [0m[32m 0.01[0m
test_003_verify_test_counter [32mOK [0m[32m 0.01[0m
test_skip_if_example [34mSKIP[0m
test_skip_test_example [34mSKIP[0m
test_skip_unless_example [34mSKIP[0m
TestStoreLocation
test_bad_store_scheme [32mOK [0m[32m 0.01[0m
test_filesystem_store_location [32mOK [0m[32m 0.01[0m
test_get_location_from_uri_back_to_uri [32mOK [0m[32m 0.02[0m
test_get_store_from_scheme [32mOK [0m[32m 0.02[0m
test_http_store_location [32mOK [0m[32m 0.01[0m
test_rbd_store_location [32mOK [0m[32m 0.01[0m
test_s3_store_location [32mOK [0m[32m 0.01[0m
test_swift_store_location [32mOK [0m[32m 0.01[0m
TestChunkReader
test_read_all_data [32mOK [0m[32m 0.01[0m
TestStoreAuthV1
test_add [32mOK [0m[32m 0.01[0m
test_add_already_existing [32mOK [0m[32m 0.01[0m
test_add_auth_url_variations [32mOK [0m[32m 0.02[0m
test_add_large_object [32mOK [0m[32m 0.01[0m
test_add_large_object_zero_size [32mOK [0m[32m 0.01[0m
test_add_no_container_and_create [32mOK [0m[32m 0.01[0m
test_add_no_container_no_create [32mOK [0m[32m 0.01[0m
test_delete [32mOK [0m[32m 0.01[0m
test_delete_non_existing [32mOK [0m[32m 0.01[0m
test_get [32mOK [0m[32m 0.01[0m
test_get_non_existing [32mOK [0m[32m 0.01[0m
test_get_size [32mOK [0m[32m 0.01[0m
test_get_with_http_auth [32mOK [0m[32m 0.01[0m
test_no_auth_address [32mOK [0m[32m 0.01[0m
test_no_key [32mOK [0m[32m 0.01[0m
test_no_user [32mOK [0m[32m 0.01[0m
test_read_acl_public [32mOK [0m[32m 0.01[0m
test_read_acl_tenants [32mOK [0m[32m 0.01[0m
test_read_write_public [32mOK [0m[32m 0.01[0m
TestStoreAuthV2
test_add [32mOK [0m[32m 0.01[0m
test_add_already_existing [32mOK [0m[32m 0.01[0m
test_add_auth_url_variations [32mOK [0m[32m 0.02[0m
test_add_large_object [32mOK [0m[32m 0.01[0m
test_add_large_object_zero_size [32mOK [0m[32m 0.01[0m
test_add_no_container_and_create [32mOK [0m[32m 0.01[0m
test_add_no_container_no_create [32mOK [0m[32m 0.01[0m
test_delete [32mOK [0m[32m 0.01[0m
test_delete_non_existing [32mOK [0m[31m 0.20[0m
test_get [32mOK [0m[32m 0.01[0m
test_get_non_existing [32mOK [0m[32m 0.01[0m
test_get_size [32mOK [0m[32m 0.01[0m
test_get_with_http_auth [32mOK [0m[32m 0.01[0m
test_no_auth_address [32mOK [0m[32m 0.01[0m
test_no_key [32mOK [0m[32m 0.01[0m
test_no_user [32mOK [0m[32m 0.01[0m
test_read_acl_public [32mOK [0m[32m 0.01[0m
test_read_acl_tenants [32mOK [0m[32m 0.01[0m
test_read_write_public [32mOK [0m[32m 0.01[0m
test_v2_multi_tenant_location [32mOK [0m[32m 0.01[0m
test_v2_with_no_tenant [32mOK [0m[32m 0.01[0m
TestUtils
test_cooperative_reader [32mOK [0m[31m 0.09[0m
test_cooperative_reader_of_iterator [32mOK [0m[32m 0.01[0m
test_generate_uuid_format [32mOK [0m[32m 0.02[0m
test_generate_uuid_unique [32mOK [0m[33m 0.03[0m
test_is_uuid_like_fails [32mOK [0m[32m 0.01[0m
test_is_uuid_like_success [32mOK [0m[32m 0.01[0m
test_limiting_reader [32mOK [0m[32m 0.02[0m
test_limiting_reader_fails [32mOK [0m[32m 0.01[0m
VersionNegotiationTest
test_request_accept_v1 [32mOK [0m[32m 0.01[0m
test_request_url_v1 [32mOK [0m[32m 0.01[0m
test_request_url_v1_0 [32mOK [0m[32m 0.01[0m
test_request_url_v1_1 [32mOK [0m[32m 0.01[0m
test_request_url_v2 [32mOK [0m[32m 0.01[0m
test_request_url_v2_0 [32mOK [0m[32m 0.01[0m
test_request_url_v2_1_unsupported [32mOK [0m[32m 0.01[0m
test_request_url_v3_unsupported [32mOK [0m[32m 0.01[0m
VersionsTest
test_get_version_list [32mOK [0m[32m 0.01[0m
JSONRequestDeserializerTest
test_default_no_body [32mOK [0m[32m 0.01[0m
test_default_with_body [32mOK [0m[32m 0.01[0m
test_from_json [32mOK [0m[32m 0.01[0m
test_from_json_malformed [32mOK [0m[32m 0.01[0m
test_has_body_has_content_length [32mOK [0m[32m 0.01[0m
test_has_body_no_content_length [32mOK [0m[32m 0.01[0m
test_has_body_zero_content_length [32mOK [0m[32m 0.01[0m
test_no_body_no_content_length [32mOK [0m[32m 0.01[0m
JSONResponseSerializerTest
test_default [32mOK [0m[32m 0.01[0m
test_to_json [32mOK [0m[32m 0.01[0m
RequestTest
test_content_type_accept_default [32mOK [0m[32m 0.01[0m
test_content_type_from_accept_json [32mOK [0m[32m 0.01[0m
test_content_type_from_accept_json_xml_quality [32mOK [0m[32m 0.01[0m
test_content_type_from_accept_xml [32mOK [0m[32m 0.01[0m
test_content_type_from_accept_xml_json [32mOK [0m[32m 0.01[0m
test_content_type_missing [32mOK [0m[32m 0.01[0m
test_content_type_unsupported [32mOK [0m[32m 0.01[0m
test_content_type_with_charset [32mOK [0m[32m 0.01[0m
ResourceTest
test_dispatch [32mOK [0m[32m 0.01[0m
test_dispatch_default [32mOK [0m[32m 0.01[0m
test_dispatch_no_default [32mOK [0m[32m 0.01[0m
test_get_action_args [32mOK [0m[32m 0.01[0m
TestHelpers
test_data_passed_properly_through_headers [32mOK [0m[32m 0.01[0m
test_headers_are_unicode [32mOK [0m[32m 0.01[0m
======================================================================
FAIL: We test that a mis-configured default_store causes the API server
----------------------------------------------------------------------
Traceback (most recent call last):
File "<https://jenkins01.openstack.org/job/periodic-glance-python26-stable-folsom/…",> line 178, in wrapped
func(*a, **kwargs)
File "<https://jenkins01.openstack.org/job/periodic-glance-python26-stable-folsom/…",> line 1234, in test_unsupported_default_store
**self.__dict__.copy())
File "<https://jenkins01.openstack.org/job/periodic-glance-python26-stable-folsom/…",> line 570, in start_server
self.assertTrue(launch_msg is None, launch_msg)
AssertionError: Unexpected server launch status
"""Fail the test unless the expression is true."""
>> if not False: raise self.failureException, 'Unexpected server launch status'
----------------------------------------------------------------------
XML: nosetests.xml
Slowest 5 tests took 112.14 secs:
[31m 39.41 TestGlanceControl.test_bouncing[0m
[31m 19.51 TestBinGlanceCacheManage.test_queue[0m
[31m 18.95 TestBinGlance.test_results_filtering[0m
[31m 17.58 TestRootApi.test_version_configurations[0m
[31m 16.68 TestScrubber.test_delayed_delete[0m
----------------------------------------------------------------------
Ran 926 tests in 812.182s
FAILED (SKIP=89, failures=1)
ERROR: InvocationError: '<https://jenkins01.openstack.org/job/periodic-glance-python26-stable-folsom/…'>
___________________________________ summary ____________________________________
ERROR: py26: commands failed
+ result=1
+ echo 'Begin pip freeze output from test virtualenv:'
Begin pip freeze output from test virtualenv:
+ echo ======================================================================
======================================================================
+ .tox/py26/bin/pip freeze
Babel==1.3
Jinja2==2.7.1
MarkupSafe==0.18
Paste==1.7.5.1
PasteDeploy==1.5.0
Pygments==1.6
Routes==1.13
SQLAlchemy==0.7.9
Sphinx==1.1.3
Tempita==0.5.1
WebOb==1.0.8
amqp==1.0.13
anyjson==0.3.3
argparse==1.2.1
boto==2.1.1
cffi==0.7.2
colorama==0.2.5
coverage==3.6
d2to1==0.2.10
decorator==3.4.0
distribute==0.7.3
docutils==0.10
eventlet==0.13.0
glance==jenkins-periodic-glance-python26-stable-folsom-2
greenlet==0.4.1
httplib2==0.8
importlib==1.0.2
iso8601==0.1.4
jsonschema==2.0.0
kombu==2.5.12
lxml==3.2.3
mox==0.5.3
nose==1.3.0
nose-exclude==0.1.10
nosehtmloutput==0.0.5
openstack.nose-plugin==0.11
ordereddict==1.1
passlib==1.6.1
pbr==0.5.21
pep8==1.1
pycparser==2.10
pycrypto==2.6
pysendfile==2.0.0
python-swiftclient==1.5.0
pytz==2013b
repoze.lru==0.6
requests==1.2.3
simplejson==3.3.0
sqlalchemy-migrate==0.7.2
termcolor==1.1.0
wsgiref==0.1.2
xattr==0.7.2
+ echo ======================================================================
======================================================================
+ '[' -d .testrepository ']'
+ sudo /usr/local/jenkins/slave_scripts/jenkins-sudo-grep.sh post
+ sudoresult=0
+ '[' 0 -ne 0 ']'
+ /usr/local/jenkins/slave_scripts/jenkins-oom-grep.sh post
+ oomresult=0
+ '[' 0 -ne 0 ']'
++ find . -name nose_results.html
+ htmlreport=./nose_results.html
+ '[' -f ./nose_results.html ']'
++ grep -c 'tr class=.passClass' ./nose_results.html
+ passcount=94
+ '[' 94 -eq 0 ']'
+ exit 1
+ rm -rf /tmp/tmp.uP0KmM2X77
Build step 'Execute shell' marked build as failure
[SCP] Connecting to static.openstack.org
[SCP] uploading file: '/srv/static/logs/periodic/periodic-glance-python26-stable-folsom/2/nose_results.html'
[SCP] Connecting to static.openstack.org
[SCP] Trying to create /srv/static/logs/periodic/periodic-glance-python26-stable-folsom/centos6-9/2
[SCP] Copying console log.
1
1
13 Aug '13
See <https://jenkins02.openstack.org/job/periodic-cinder-python27-stable-grizzly…>
Changes:
[thierry] Use utils.safe_minidom_parse_string in extensions
[apevec] Bump stable/grizzly next version to 2013.1.4
------------------------------------------
[...truncated 1558 lines...]
test_delete_volume [32mOK [0m[32m 0.02[0m
test_ensure_export [32mOK [0m[32m 0.02[0m
test_initialize_connection [32mOK [0m[32m 0.02[0m
test_remove_export [32mOK [0m[32m 0.02[0m
ExceptionTest
test_exception_with_none_code_throws_500 [32mOK [0m[32m 0.01[0m
test_non_cinder_exception_mapping [32mOK [0m[32m 0.01[0m
test_non_cinder_notfound_exception_mapping [32mOK [0m[32m 0.01[0m
test_quota_error_mapping [32mOK [0m[32m 0.02[0m
test_safe_exceptions_are_described_in_faults [32mOK [0m[32m 0.01[0m
test_unsafe_exceptions_are_not_described_in_faults [32mOK [0m[32m 0.01[0m
TestLoaderNormalFilesystem
test_app_found [32mOK [0m[32m 0.01[0m
test_app_not_found [32mOK [0m[32m 0.00[0m
test_config_found [32mOK [0m[32m 0.00[0m
TestLoaderNothingExists
test_config_not_found [32mOK [0m[32m 0.01[0m
TestWSGIServer
test_app [32mOK [0m[32m 0.00[0m
test_app_using_ipv6_and_ssl [32mOK [0m[33m 0.03[0m
test_app_using_ssl [32mOK [0m[33m 0.03[0m
test_no_app [32mOK [0m[32m 0.00[0m
test_start_random_port [32mOK [0m[32m 0.00[0m
test_start_random_port_with_ipv6 [32mOK [0m[32m 0.00[0m
DriverTestCase
test_config_options [32mOK [0m[32m 0.00[0m
test_copy_image_to_volume_non_xenserver_case [32mOK [0m[32m 0.00[0m
test_copy_image_to_volume_xenserver_case [32mOK [0m[32m 0.00[0m
test_copy_volume_to_image_non_xenserver_case [32mOK [0m[32m 0.00[0m
test_copy_volume_to_image_xenserver_case [32mOK [0m[32m 0.00[0m
test_create_export_does_not_raise_exception [32mOK [0m[32m 0.00[0m
test_create_snapshot [32mOK [0m[32m 0.00[0m
test_create_volume [32mOK [0m[32m 0.00[0m
test_create_volume_from_snapshot [32mOK [0m[32m 0.00[0m
test_delete_snapshot [32mOK [0m[32m 0.00[0m
test_delete_volume [32mOK [0m[32m 0.00[0m
test_do_setup [32mOK [0m[32m 0.00[0m
test_get_volume_stats_reports_required_keys [32mOK [0m[32m 0.00[0m
test_get_volume_stats_reports_unknown_cap [32mOK [0m[32m 0.00[0m
test_initialize_connection [32mOK [0m[32m 0.00[0m
test_initialize_connection_null_values [32mOK [0m[32m 0.00[0m
test_remove_export_does_not_raise_exception [32mOK [0m[32m 0.00[0m
test_reported_driver_type [32mOK [0m[32m 0.00[0m
test_use_glance_plugin_to_copy_image_to_volume_fail [32mOK [0m[32m 0.00[0m
test_use_glance_plugin_to_copy_image_to_volume_success [32mOK [0m[32m 0.00[0m
test_use_glance_plugin_to_upload_volume [32mOK [0m[32m 0.00[0m
test_use_image_utils_to_pipe_bytes_to_volume [32mOK [0m[32m 0.00[0m
test_use_image_utils_to_upload_volume [32mOK [0m[32m 0.00[0m
ToolsTest
test_get_this_vm_uuid [32mOK [0m[32m 0.00[0m
test_stripped_first_line_of [32mOK [0m[32m 0.00[0m
XIVVolumeDriverTest
test_create_volume [32mOK [0m[32m 0.01[0m
test_create_volume_should_fail_if_no_pool_space_left [32mOK [0m[32m 0.01[0m
test_delete_volume [32mOK [0m[32m 0.01[0m
test_delete_volume_should_fail_for_not_existing_volume [32mOK [0m[32m 0.01[0m
test_initialize_connection [32mOK [0m[32m 0.01[0m
test_initialize_connection_should_fail_for_non_existing_volume[32mOK [0m[32m 0.01[0m
test_initialized_should_set_xiv_info [32mOK [0m[32m 0.01[0m
test_setup_should_fail_if_connection_is_invalid [32mOK [0m[32m 0.01[0m
test_setup_should_fail_if_credentials_are_invalid [32mOK [0m[32m 0.01[0m
test_terminate_connection [32mOK [0m[32m 0.01[0m
test_terminate_connection_should_fail_on_non_attached_volume [32mOK [0m[32m 0.01[0m
test_terminate_connection_should_fail_on_non_existing_volume [32mOK [0m[32m 0.01[0m
test_volume_exists [32mOK [0m[32m 0.01[0m
ZadaraVPSADriverTestCase
test_bad_http_response [32mOK [0m[32m 0.01[0m
test_create_destroy [32mOK [0m[32m 0.01[0m
test_create_destroy_multiple [32mOK [0m[32m 0.02[0m
test_delete_without_detach [32mOK [0m[33m 0.04[0m
test_destroy_non_existent [32mOK [0m[32m 0.01[0m
test_empty_apis [32mOK [0m[32m 0.01[0m
test_no_active_ctrl [32mOK [0m[32m 0.01[0m
test_ssl_use [32mOK [0m[32m 0.01[0m
test_volume_attach_detach [32mOK [0m[32m 0.02[0m
test_volume_attach_multiple_detach [32mOK [0m[33m 0.03[0m
test_wrong_attach_params [32mOK [0m[32m 0.01[0m
test_wrong_detach_params [32mOK [0m[32m 0.02[0m
test_wrong_login_reply [32mOK [0m[32m 0.01[0m
======================================================================
ERROR: Test glance version set by arg to GlanceClientWrapper
----------------------------------------------------------------------
Traceback (most recent call last):
File "<https://jenkins02.openstack.org/job/periodic-cinder-python27-stable-grizzly…",> line 576, in test_glance_version_by_arg
9292, version=2)
File "<https://jenkins02.openstack.org/job/periodic-cinder-python27-stable-grizzly…",> line 103, in __init__
use_ssl, version)
File "<https://jenkins02.openstack.org/job/periodic-cinder-python27-stable-grizzly…",> line 117, in _create_static_client
self.use_ssl, self.version)
File "<https://jenkins02.openstack.org/job/periodic-cinder-python27-stable-grizzly…",> line 73, in _create_glance_client
return glanceclient.Client(str(version), endpoint, **params)
File "<https://jenkins02.openstack.org/job/periodic-cinder-python27-stable-grizzly…",> line 22, in Client
return client_class(*args, **kwargs)
File "<https://jenkins02.openstack.org/job/periodic-cinder-python27-stable-grizzly…",> line 43, in __init__
self._get_member_model())
File "<https://jenkins02.openstack.org/job/periodic-cinder-python27-stable-grizzly…",> line 50, in _get_member_model
schema = self.schemas.get('member')
File "<https://jenkins02.openstack.org/job/periodic-cinder-python27-stable-grizzly…",> line 53, in get
_, raw_schema = self.http_client.json_request('GET', uri)
File "<https://jenkins02.openstack.org/job/periodic-cinder-python27-stable-grizzly…",> line 250, in json_request
resp, body_iter = self._http_request(url, method, **kwargs)
File "<https://jenkins02.openstack.org/job/periodic-cinder-python27-stable-grizzly…",> line 216, in _http_request
raise exc.InvalidEndpoint(message=message)
InvalidEndpoint: Error finding address for fake_host: [Errno -2] Name or service not known
-------------------- >> begin captured logging << --------------------
glanceclient.common.http: DEBUG: curl -i -X GET -H 'Content-Type: application/json' -H 'User-Agent: python-glanceclient' http://fake_host:9292/v2/schemas/member
--------------------- >> end captured logging << ---------------------
======================================================================
ERROR: Test glance version set by flag is honoured
----------------------------------------------------------------------
Traceback (most recent call last):
File "<https://jenkins02.openstack.org/job/periodic-cinder-python27-stable-grizzly…",> line 564, in test_glance_version_by_flag
9292)
File "<https://jenkins02.openstack.org/job/periodic-cinder-python27-stable-grizzly…",> line 103, in __init__
use_ssl, version)
File "<https://jenkins02.openstack.org/job/periodic-cinder-python27-stable-grizzly…",> line 117, in _create_static_client
self.use_ssl, self.version)
File "<https://jenkins02.openstack.org/job/periodic-cinder-python27-stable-grizzly…",> line 73, in _create_glance_client
return glanceclient.Client(str(version), endpoint, **params)
File "<https://jenkins02.openstack.org/job/periodic-cinder-python27-stable-grizzly…",> line 22, in Client
return client_class(*args, **kwargs)
File "<https://jenkins02.openstack.org/job/periodic-cinder-python27-stable-grizzly…",> line 43, in __init__
self._get_member_model())
File "<https://jenkins02.openstack.org/job/periodic-cinder-python27-stable-grizzly…",> line 50, in _get_member_model
schema = self.schemas.get('member')
File "<https://jenkins02.openstack.org/job/periodic-cinder-python27-stable-grizzly…",> line 53, in get
_, raw_schema = self.http_client.json_request('GET', uri)
File "<https://jenkins02.openstack.org/job/periodic-cinder-python27-stable-grizzly…",> line 250, in json_request
resp, body_iter = self._http_request(url, method, **kwargs)
File "<https://jenkins02.openstack.org/job/periodic-cinder-python27-stable-grizzly…",> line 216, in _http_request
raise exc.InvalidEndpoint(message=message)
InvalidEndpoint: Error finding address for fake_host: [Errno -2] Name or service not known
-------------------- >> begin captured logging << --------------------
glanceclient.common.http: DEBUG: curl -i -X GET -H 'Content-Type: application/json' -H 'User-Agent: python-glanceclient' http://fake_host:9292/v2/schemas/member
--------------------- >> end captured logging << ---------------------
----------------------------------------------------------------------
XML: nosetests.xml
Slowest 5 tests took 9.69 secs:
[31m 2.27 TestMigrations.test_postgresql_opportunistically[0m
[31m 2.01 SolidFireVolumeTestCase.test_create_volume[0m
[31m 2.01 SolidFireVolumeTestCase.test_create_with_qos_type[0m
[31m 2.01 SolidFireVolumeTestCase.test_create_volume_with_qos[0m
[31m 1.38 ScalityDriverTestCase.test_create_snapshot[0m
----------------------------------------------------------------------
Ran 1323 tests in 62.654s
FAILED (SKIP=52, errors=2)
ERROR: InvocationError: '<https://jenkins02.openstack.org/job/periodic-cinder-python27-stable-grizzly…'>
___________________________________ summary ____________________________________
ERROR: py27: commands failed
+ result=1
+ echo 'Begin pip freeze output from test virtualenv:'
Begin pip freeze output from test virtualenv:
+ echo ======================================================================
======================================================================
+ .tox/py27/bin/pip freeze
Babel==1.3
Jinja2==2.7.1
MarkupSafe==0.18
MySQL-python==1.2.4
Paste==1.7.5.1
PasteDeploy==1.5.0
Pygments==1.6
Routes==1.13
SQLAlchemy==0.7.9
Sphinx==1.1.3
Tempita==0.5.1
WebOb==1.2.3
amqp==1.0.13
amqplib==1.0.2
anyjson==0.3.3
argparse==1.2.1
cinder==jenkins.periodic.cinder.python27.stable.grizzly.2
colorama==0.2.5
coverage==3.6
d2to1==0.2.10
decorator==3.4.0
distribute==0.7.3
docutils==0.10
eventlet==0.13.0
greenlet==0.4.1
hp3parclient==1.0.0
httplib2==0.8
iso8601==0.1.4
jsonpatch==1.1
jsonpointer==1.0
jsonschema==2.0.0
kombu==2.5.12
lockfile==0.9.1
logilab-astng==0.24.3
logilab-common==0.60.0
lxml==3.2.3
mock==1.0.1
mox==0.5.3
nose==1.3.0
nosehtmloutput==0.0.5
nosexcover==1.0.8
openstack.nose-plugin==0.11
oslo.config==1.1.1
paramiko==1.11.0
pbr==0.5.21
pep8==1.3.3
prettytable==0.7.2
psycopg2==2.5.1
pyOpenSSL==0.13
pycrypto==2.6
pylint==0.25.2
python-glanceclient==0.10.0
python-keystoneclient==0.3.1
python-swiftclient==1.5.0
pytz==2013b
repoze.lru==0.6
requests==1.2.3
setuptools-git==1.0
simplejson==3.3.0
six==1.3.0
sqlalchemy-migrate==0.7.2
stevedore==0.10
suds==0.4
termcolor==1.1.0
warlock==1.0.1
wsgiref==0.1.2
+ echo ======================================================================
======================================================================
+ '[' -d .testrepository ']'
+ sudo /usr/local/jenkins/slave_scripts/jenkins-sudo-grep.sh post
+ sudoresult=0
+ '[' 0 -ne 0 ']'
+ /usr/local/jenkins/slave_scripts/jenkins-oom-grep.sh post
+ oomresult=0
+ '[' 0 -ne 0 ']'
++ find . -name nose_results.html
+ htmlreport=./nose_results.html
+ '[' -f ./nose_results.html ']'
++ grep -c 'tr class=.passClass' ./nose_results.html
+ passcount=178
+ '[' 178 -eq 0 ']'
+ exit 1
+ rm -rf /tmp/tmp.UceGaqgoji
Build step 'Execute shell' marked build as failure
[SCP] Connecting to static.openstack.org
[SCP] uploading file: '/srv/static/logs/periodic/periodic-cinder-python27-stable-grizzly/2/nose_results.html'
[SCP] Connecting to static.openstack.org
[SCP] Trying to create /srv/static/logs/periodic/periodic-cinder-python27-stable-grizzly/precise2
[SCP] Trying to create /srv/static/logs/periodic/periodic-cinder-python27-stable-grizzly/precise2/2
[SCP] Copying console log.
1
2
13 Aug '13
See <https://jenkins02.openstack.org/job/periodic-cinder-python26-stable-grizzly…>
------------------------------------------
[...truncated 1561 lines...]
test_remove_export [32mOK [0m[32m 0.02[0m
ExceptionTest
test_exception_with_none_code_throws_500 [32mOK [0m[32m 0.01[0m
test_non_cinder_exception_mapping [32mOK [0m[32m 0.01[0m
test_non_cinder_notfound_exception_mapping [32mOK [0m[32m 0.01[0m
test_quota_error_mapping [32mOK [0m[32m 0.01[0m
test_safe_exceptions_are_described_in_faults [32mOK [0m[32m 0.01[0m
test_unsafe_exceptions_are_not_described_in_faults [32mOK [0m[32m 0.01[0m
TestLoaderNormalFilesystem
test_app_found [32mOK [0m[32m 0.01[0m
test_app_not_found [32mOK [0m[32m 0.00[0m
test_config_found [32mOK [0m[32m 0.00[0m
TestLoaderNothingExists
test_config_not_found [32mOK [0m[32m 0.01[0m
TestWSGIServer
test_app [32mOK [0m[33m 0.03[0m
test_app_using_ipv6_and_ssl [32mOK [0m[33m 0.04[0m
test_app_using_ssl [32mOK [0m[33m 0.04[0m
test_no_app [32mOK [0m[32m 0.00[0m
test_start_random_port [32mOK [0m[32m 0.00[0m
test_start_random_port_with_ipv6 [32mOK [0m[32m 0.00[0m
DriverTestCase
test_config_options [32mOK [0m[32m 0.00[0m
test_copy_image_to_volume_non_xenserver_case [32mOK [0m[32m 0.00[0m
test_copy_image_to_volume_xenserver_case [32mOK [0m[32m 0.00[0m
test_copy_volume_to_image_non_xenserver_case [32mOK [0m[32m 0.00[0m
test_copy_volume_to_image_xenserver_case [32mOK [0m[32m 0.00[0m
test_create_export_does_not_raise_exception [32mOK [0m[32m 0.00[0m
test_create_snapshot [32mOK [0m[32m 0.00[0m
test_create_volume [32mOK [0m[32m 0.00[0m
test_create_volume_from_snapshot [32mOK [0m[32m 0.00[0m
test_delete_snapshot [32mOK [0m[32m 0.00[0m
test_delete_volume [32mOK [0m[32m 0.00[0m
test_do_setup [32mOK [0m[32m 0.00[0m
test_get_volume_stats_reports_required_keys [32mOK [0m[32m 0.00[0m
test_get_volume_stats_reports_unknown_cap [32mOK [0m[32m 0.00[0m
test_initialize_connection [32mOK [0m[32m 0.00[0m
test_initialize_connection_null_values [32mOK [0m[32m 0.00[0m
test_remove_export_does_not_raise_exception [32mOK [0m[32m 0.00[0m
test_reported_driver_type [32mOK [0m[32m 0.00[0m
test_use_glance_plugin_to_copy_image_to_volume_fail [32mOK [0m[32m 0.00[0m
test_use_glance_plugin_to_copy_image_to_volume_success [32mOK [0m[32m 0.00[0m
test_use_glance_plugin_to_upload_volume [32mOK [0m[32m 0.00[0m
test_use_image_utils_to_pipe_bytes_to_volume [32mOK [0m[32m 0.00[0m
test_use_image_utils_to_upload_volume [32mOK [0m[32m 0.00[0m
ToolsTest
test_get_this_vm_uuid [32mOK [0m[32m 0.00[0m
test_stripped_first_line_of [32mOK [0m[32m 0.00[0m
XIVVolumeDriverTest
test_create_volume [32mOK [0m[32m 0.01[0m
test_create_volume_should_fail_if_no_pool_space_left [32mOK [0m[32m 0.01[0m
test_delete_volume [32mOK [0m[32m 0.01[0m
test_delete_volume_should_fail_for_not_existing_volume [32mOK [0m[32m 0.01[0m
test_initialize_connection [32mOK [0m[32m 0.01[0m
test_initialize_connection_should_fail_for_non_existing_volume[32mOK [0m[32m 0.01[0m
test_initialized_should_set_xiv_info [32mOK [0m[32m 0.01[0m
test_setup_should_fail_if_connection_is_invalid [32mOK [0m[32m 0.01[0m
test_setup_should_fail_if_credentials_are_invalid [32mOK [0m[32m 0.01[0m
test_terminate_connection [32mOK [0m[32m 0.01[0m
test_terminate_connection_should_fail_on_non_attached_volume [32mOK [0m[32m 0.01[0m
test_terminate_connection_should_fail_on_non_existing_volume [32mOK [0m[32m 0.02[0m
test_volume_exists [32mOK [0m[32m 0.01[0m
ZadaraVPSADriverTestCase
test_bad_http_response [32mOK [0m[32m 0.01[0m
test_create_destroy [32mOK [0m[32m 0.02[0m
test_create_destroy_multiple [32mOK [0m[32m 0.02[0m
test_delete_without_detach [32mOK [0m[33m 0.04[0m
test_destroy_non_existent [32mOK [0m[32m 0.01[0m
test_empty_apis [32mOK [0m[32m 0.01[0m
test_no_active_ctrl [32mOK [0m[32m 0.02[0m
test_ssl_use [32mOK [0m[32m 0.01[0m
test_volume_attach_detach [32mOK [0m[32m 0.02[0m
test_volume_attach_multiple_detach [32mOK [0m[33m 0.04[0m
test_wrong_attach_params [32mOK [0m[32m 0.01[0m
test_wrong_detach_params [32mOK [0m[33m 0.03[0m
test_wrong_login_reply [32mOK [0m[32m 0.01[0m
======================================================================
ERROR: Test glance version set by arg to GlanceClientWrapper
----------------------------------------------------------------------
Traceback (most recent call last):
File "<https://jenkins02.openstack.org/job/periodic-cinder-python26-stable-grizzly…",> line 576, in test_glance_version_by_arg
9292, version=2)
File "<https://jenkins02.openstack.org/job/periodic-cinder-python26-stable-grizzly…",> line 103, in __init__
use_ssl, version)
File "<https://jenkins02.openstack.org/job/periodic-cinder-python26-stable-grizzly…",> line 117, in _create_static_client
self.use_ssl, self.version)
File "<https://jenkins02.openstack.org/job/periodic-cinder-python26-stable-grizzly…",> line 73, in _create_glance_client
return glanceclient.Client(str(version), endpoint, **params)
File "<https://jenkins02.openstack.org/job/periodic-cinder-python26-stable-grizzly…",> line 22, in Client
return client_class(*args, **kwargs)
File "<https://jenkins02.openstack.org/job/periodic-cinder-python26-stable-grizzly…",> line 43, in __init__
self._get_member_model())
File "<https://jenkins02.openstack.org/job/periodic-cinder-python26-stable-grizzly…",> line 50, in _get_member_model
schema = self.schemas.get('member')
File "<https://jenkins02.openstack.org/job/periodic-cinder-python26-stable-grizzly…",> line 53, in get
_, raw_schema = self.http_client.json_request('GET', uri)
File "<https://jenkins02.openstack.org/job/periodic-cinder-python26-stable-grizzly…",> line 250, in json_request
resp, body_iter = self._http_request(url, method, **kwargs)
File "<https://jenkins02.openstack.org/job/periodic-cinder-python26-stable-grizzly…",> line 216, in _http_request
raise exc.InvalidEndpoint(message=message)
InvalidEndpoint: Error finding address for fake_host: [Errno -2] Name or service not known
-------------------- >> begin captured logging << --------------------
glanceclient.common.http: DEBUG: curl -i -X GET -H 'Content-Type: application/json' -H 'User-Agent: python-glanceclient' http://fake_host:9292/v2/schemas/member
--------------------- >> end captured logging << ---------------------
======================================================================
ERROR: Test glance version set by flag is honoured
----------------------------------------------------------------------
Traceback (most recent call last):
File "<https://jenkins02.openstack.org/job/periodic-cinder-python26-stable-grizzly…",> line 564, in test_glance_version_by_flag
9292)
File "<https://jenkins02.openstack.org/job/periodic-cinder-python26-stable-grizzly…",> line 103, in __init__
use_ssl, version)
File "<https://jenkins02.openstack.org/job/periodic-cinder-python26-stable-grizzly…",> line 117, in _create_static_client
self.use_ssl, self.version)
File "<https://jenkins02.openstack.org/job/periodic-cinder-python26-stable-grizzly…",> line 73, in _create_glance_client
return glanceclient.Client(str(version), endpoint, **params)
File "<https://jenkins02.openstack.org/job/periodic-cinder-python26-stable-grizzly…",> line 22, in Client
return client_class(*args, **kwargs)
File "<https://jenkins02.openstack.org/job/periodic-cinder-python26-stable-grizzly…",> line 43, in __init__
self._get_member_model())
File "<https://jenkins02.openstack.org/job/periodic-cinder-python26-stable-grizzly…",> line 50, in _get_member_model
schema = self.schemas.get('member')
File "<https://jenkins02.openstack.org/job/periodic-cinder-python26-stable-grizzly…",> line 53, in get
_, raw_schema = self.http_client.json_request('GET', uri)
File "<https://jenkins02.openstack.org/job/periodic-cinder-python26-stable-grizzly…",> line 250, in json_request
resp, body_iter = self._http_request(url, method, **kwargs)
File "<https://jenkins02.openstack.org/job/periodic-cinder-python26-stable-grizzly…",> line 216, in _http_request
raise exc.InvalidEndpoint(message=message)
InvalidEndpoint: Error finding address for fake_host: [Errno -2] Name or service not known
-------------------- >> begin captured logging << --------------------
glanceclient.common.http: DEBUG: curl -i -X GET -H 'Content-Type: application/json' -H 'User-Agent: python-glanceclient' http://fake_host:9292/v2/schemas/member
--------------------- >> end captured logging << ---------------------
----------------------------------------------------------------------
XML: nosetests.xml
Slowest 5 tests took 9.71 secs:
[31m 2.43 TestMigrations.test_postgresql_opportunistically[0m
[31m 2.01 SolidFireVolumeTestCase.test_create_volume_with_qos[0m
[31m 2.01 SolidFireVolumeTestCase.test_create_with_qos_type[0m
[31m 2.01 SolidFireVolumeTestCase.test_create_volume[0m
[31m 1.24 ScalityDriverTestCase.test_delete_snapshot[0m
----------------------------------------------------------------------
Ran 1323 tests in 71.796s
FAILED (SKIP=52, errors=2)
ERROR: InvocationError: '<https://jenkins02.openstack.org/job/periodic-cinder-python26-stable-grizzly…'>
___________________________________ summary ____________________________________
ERROR: py26: commands failed
+ result=1
+ echo 'Begin pip freeze output from test virtualenv:'
Begin pip freeze output from test virtualenv:
+ echo ======================================================================
======================================================================
+ .tox/py26/bin/pip freeze
Babel==1.3
Jinja2==2.7.1
MarkupSafe==0.18
MySQL-python==1.2.4
Paste==1.7.5.1
PasteDeploy==1.5.0
Pygments==1.6
Routes==1.13
SQLAlchemy==0.7.9
Sphinx==1.1.3
Tempita==0.5.1
WebOb==1.2.3
amqp==1.0.13
amqplib==1.0.2
anyjson==0.3.3
argparse==1.2.1
cinder==jenkins.periodic.cinder.python26.stable.grizzly.3
colorama==0.2.5
coverage==3.6
d2to1==0.2.10
decorator==3.4.0
distribute==0.7.3
docutils==0.10
eventlet==0.13.0
greenlet==0.4.1
hp3parclient==1.0.0
httplib2==0.8
importlib==1.0.2
iso8601==0.1.4
jsonpatch==1.1
jsonpointer==1.0
jsonschema==2.0.0
kombu==2.5.12
lockfile==0.9.1
logilab-astng==0.24.3
logilab-common==0.60.0
lxml==3.2.3
mock==1.0.1
mox==0.5.3
nose==1.3.0
nosehtmloutput==0.0.5
nosexcover==1.0.8
openstack.nose-plugin==0.11
ordereddict==1.1
oslo.config==1.1.1
paramiko==1.11.0
pbr==0.5.21
pep8==1.3.3
prettytable==0.7.2
psycopg2==2.5.1
pyOpenSSL==0.13
pycrypto==2.6
pylint==0.25.2
python-glanceclient==0.10.0
python-keystoneclient==0.3.1
python-swiftclient==1.5.0
pytz==2013b
repoze.lru==0.6
requests==1.2.3
setuptools-git==1.0
simplejson==3.3.0
six==1.3.0
sqlalchemy-migrate==0.7.2
stevedore==0.10
suds==0.4
termcolor==1.1.0
unittest2==0.5.1
warlock==1.0.1
wsgiref==0.1.2
+ echo ======================================================================
======================================================================
+ '[' -d .testrepository ']'
+ sudo /usr/local/jenkins/slave_scripts/jenkins-sudo-grep.sh post
+ sudoresult=0
+ '[' 0 -ne 0 ']'
+ /usr/local/jenkins/slave_scripts/jenkins-oom-grep.sh post
+ oomresult=0
+ '[' 0 -ne 0 ']'
++ find . -name nose_results.html
+ htmlreport=./nose_results.html
+ '[' -f ./nose_results.html ']'
++ grep -c 'tr class=.passClass' ./nose_results.html
+ passcount=178
+ '[' 178 -eq 0 ']'
+ exit 1
+ rm -rf /tmp/tmp.4h8tIvPqAV
Build step 'Execute shell' marked build as failure
[SCP] Connecting to static.openstack.org
[SCP] uploading file: '/srv/static/logs/periodic/periodic-cinder-python26-stable-grizzly/3/nose_results.html'
[SCP] Connecting to static.openstack.org
[SCP] Trying to create /srv/static/logs/periodic/periodic-cinder-python26-stable-grizzly/centos6-12
[SCP] Trying to create /srv/static/logs/periodic/periodic-cinder-python26-stable-grizzly/centos6-12/3
[SCP] Copying console log.
1
3
12 Aug '13
See <https://jenkins01.openstack.org/job/periodic-cinder-python27-stable-grizzly…>
------------------------------------------
[...truncated 1558 lines...]
test_delete_volume [32mOK [0m[32m 0.02[0m
test_ensure_export [32mOK [0m[32m 0.02[0m
test_initialize_connection [32mOK [0m[32m 0.02[0m
test_remove_export [32mOK [0m[33m 0.03[0m
ExceptionTest
test_exception_with_none_code_throws_500 [32mOK [0m[32m 0.01[0m
test_non_cinder_exception_mapping [32mOK [0m[32m 0.01[0m
test_non_cinder_notfound_exception_mapping [32mOK [0m[32m 0.01[0m
test_quota_error_mapping [32mOK [0m[32m 0.01[0m
test_safe_exceptions_are_described_in_faults [32mOK [0m[32m 0.01[0m
test_unsafe_exceptions_are_not_described_in_faults [32mOK [0m[32m 0.01[0m
TestLoaderNormalFilesystem
test_app_found [32mOK [0m[32m 0.01[0m
test_app_not_found [32mOK [0m[32m 0.00[0m
test_config_found [32mOK [0m[32m 0.00[0m
TestLoaderNothingExists
test_config_not_found [32mOK [0m[32m 0.01[0m
TestWSGIServer
test_app [32mOK [0m[32m 0.00[0m
test_app_using_ipv6_and_ssl [32mOK [0m[33m 0.03[0m
test_app_using_ssl [32mOK [0m[33m 0.03[0m
test_no_app [32mOK [0m[32m 0.00[0m
test_start_random_port [32mOK [0m[32m 0.00[0m
test_start_random_port_with_ipv6 [32mOK [0m[32m 0.00[0m
DriverTestCase
test_config_options [32mOK [0m[32m 0.00[0m
test_copy_image_to_volume_non_xenserver_case [32mOK [0m[32m 0.00[0m
test_copy_image_to_volume_xenserver_case [32mOK [0m[32m 0.00[0m
test_copy_volume_to_image_non_xenserver_case [32mOK [0m[32m 0.00[0m
test_copy_volume_to_image_xenserver_case [32mOK [0m[32m 0.00[0m
test_create_export_does_not_raise_exception [32mOK [0m[32m 0.00[0m
test_create_snapshot [32mOK [0m[32m 0.00[0m
test_create_volume [32mOK [0m[32m 0.00[0m
test_create_volume_from_snapshot [32mOK [0m[32m 0.00[0m
test_delete_snapshot [32mOK [0m[32m 0.00[0m
test_delete_volume [32mOK [0m[32m 0.00[0m
test_do_setup [32mOK [0m[32m 0.00[0m
test_get_volume_stats_reports_required_keys [32mOK [0m[32m 0.00[0m
test_get_volume_stats_reports_unknown_cap [32mOK [0m[32m 0.00[0m
test_initialize_connection [32mOK [0m[32m 0.00[0m
test_initialize_connection_null_values [32mOK [0m[32m 0.00[0m
test_remove_export_does_not_raise_exception [32mOK [0m[32m 0.00[0m
test_reported_driver_type [32mOK [0m[32m 0.00[0m
test_use_glance_plugin_to_copy_image_to_volume_fail [32mOK [0m[32m 0.00[0m
test_use_glance_plugin_to_copy_image_to_volume_success [32mOK [0m[32m 0.00[0m
test_use_glance_plugin_to_upload_volume [32mOK [0m[32m 0.00[0m
test_use_image_utils_to_pipe_bytes_to_volume [32mOK [0m[32m 0.00[0m
test_use_image_utils_to_upload_volume [32mOK [0m[32m 0.00[0m
ToolsTest
test_get_this_vm_uuid [32mOK [0m[32m 0.00[0m
test_stripped_first_line_of [32mOK [0m[32m 0.00[0m
XIVVolumeDriverTest
test_create_volume [32mOK [0m[32m 0.01[0m
test_create_volume_should_fail_if_no_pool_space_left [32mOK [0m[32m 0.01[0m
test_delete_volume [32mOK [0m[32m 0.01[0m
test_delete_volume_should_fail_for_not_existing_volume [32mOK [0m[32m 0.01[0m
test_initialize_connection [32mOK [0m[32m 0.01[0m
test_initialize_connection_should_fail_for_non_existing_volume[32mOK [0m[32m 0.01[0m
test_initialized_should_set_xiv_info [32mOK [0m[32m 0.01[0m
test_setup_should_fail_if_connection_is_invalid [32mOK [0m[32m 0.01[0m
test_setup_should_fail_if_credentials_are_invalid [32mOK [0m[32m 0.01[0m
test_terminate_connection [32mOK [0m[32m 0.01[0m
test_terminate_connection_should_fail_on_non_attached_volume [32mOK [0m[32m 0.01[0m
test_terminate_connection_should_fail_on_non_existing_volume [32mOK [0m[32m 0.01[0m
test_volume_exists [32mOK [0m[32m 0.01[0m
ZadaraVPSADriverTestCase
test_bad_http_response [32mOK [0m[32m 0.02[0m
test_create_destroy [32mOK [0m[32m 0.01[0m
test_create_destroy_multiple [32mOK [0m[32m 0.02[0m
test_delete_without_detach [32mOK [0m[33m 0.03[0m
test_destroy_non_existent [32mOK [0m[32m 0.01[0m
test_empty_apis [32mOK [0m[32m 0.01[0m
test_no_active_ctrl [32mOK [0m[32m 0.01[0m
test_ssl_use [32mOK [0m[32m 0.01[0m
test_volume_attach_detach [32mOK [0m[32m 0.02[0m
test_volume_attach_multiple_detach [32mOK [0m[33m 0.03[0m
test_wrong_attach_params [32mOK [0m[32m 0.01[0m
test_wrong_detach_params [32mOK [0m[33m 0.03[0m
test_wrong_login_reply [32mOK [0m[32m 0.01[0m
======================================================================
ERROR: Test glance version set by arg to GlanceClientWrapper
----------------------------------------------------------------------
Traceback (most recent call last):
File "<https://jenkins01.openstack.org/job/periodic-cinder-python27-stable-grizzly…",> line 576, in test_glance_version_by_arg
9292, version=2)
File "<https://jenkins01.openstack.org/job/periodic-cinder-python27-stable-grizzly…",> line 103, in __init__
use_ssl, version)
File "<https://jenkins01.openstack.org/job/periodic-cinder-python27-stable-grizzly…",> line 117, in _create_static_client
self.use_ssl, self.version)
File "<https://jenkins01.openstack.org/job/periodic-cinder-python27-stable-grizzly…",> line 73, in _create_glance_client
return glanceclient.Client(str(version), endpoint, **params)
File "<https://jenkins01.openstack.org/job/periodic-cinder-python27-stable-grizzly…",> line 22, in Client
return client_class(*args, **kwargs)
File "<https://jenkins01.openstack.org/job/periodic-cinder-python27-stable-grizzly…",> line 43, in __init__
self._get_member_model())
File "<https://jenkins01.openstack.org/job/periodic-cinder-python27-stable-grizzly…",> line 50, in _get_member_model
schema = self.schemas.get('member')
File "<https://jenkins01.openstack.org/job/periodic-cinder-python27-stable-grizzly…",> line 53, in get
_, raw_schema = self.http_client.json_request('GET', uri)
File "<https://jenkins01.openstack.org/job/periodic-cinder-python27-stable-grizzly…",> line 250, in json_request
resp, body_iter = self._http_request(url, method, **kwargs)
File "<https://jenkins01.openstack.org/job/periodic-cinder-python27-stable-grizzly…",> line 216, in _http_request
raise exc.InvalidEndpoint(message=message)
InvalidEndpoint: Error finding address for fake_host: [Errno -2] Name or service not known
-------------------- >> begin captured logging << --------------------
glanceclient.common.http: DEBUG: curl -i -X GET -H 'Content-Type: application/json' -H 'User-Agent: python-glanceclient' http://fake_host:9292/v2/schemas/member
--------------------- >> end captured logging << ---------------------
======================================================================
ERROR: Test glance version set by flag is honoured
----------------------------------------------------------------------
Traceback (most recent call last):
File "<https://jenkins01.openstack.org/job/periodic-cinder-python27-stable-grizzly…",> line 564, in test_glance_version_by_flag
9292)
File "<https://jenkins01.openstack.org/job/periodic-cinder-python27-stable-grizzly…",> line 103, in __init__
use_ssl, version)
File "<https://jenkins01.openstack.org/job/periodic-cinder-python27-stable-grizzly…",> line 117, in _create_static_client
self.use_ssl, self.version)
File "<https://jenkins01.openstack.org/job/periodic-cinder-python27-stable-grizzly…",> line 73, in _create_glance_client
return glanceclient.Client(str(version), endpoint, **params)
File "<https://jenkins01.openstack.org/job/periodic-cinder-python27-stable-grizzly…",> line 22, in Client
return client_class(*args, **kwargs)
File "<https://jenkins01.openstack.org/job/periodic-cinder-python27-stable-grizzly…",> line 43, in __init__
self._get_member_model())
File "<https://jenkins01.openstack.org/job/periodic-cinder-python27-stable-grizzly…",> line 50, in _get_member_model
schema = self.schemas.get('member')
File "<https://jenkins01.openstack.org/job/periodic-cinder-python27-stable-grizzly…",> line 53, in get
_, raw_schema = self.http_client.json_request('GET', uri)
File "<https://jenkins01.openstack.org/job/periodic-cinder-python27-stable-grizzly…",> line 250, in json_request
resp, body_iter = self._http_request(url, method, **kwargs)
File "<https://jenkins01.openstack.org/job/periodic-cinder-python27-stable-grizzly…",> line 216, in _http_request
raise exc.InvalidEndpoint(message=message)
InvalidEndpoint: Error finding address for fake_host: [Errno -2] Name or service not known
-------------------- >> begin captured logging << --------------------
glanceclient.common.http: DEBUG: curl -i -X GET -H 'Content-Type: application/json' -H 'User-Agent: python-glanceclient' http://fake_host:9292/v2/schemas/member
--------------------- >> end captured logging << ---------------------
----------------------------------------------------------------------
XML: nosetests.xml
Slowest 5 tests took 9.62 secs:
[31m 2.26 TestMigrations.test_postgresql_opportunistically[0m
[31m 2.02 SolidFireVolumeTestCase.test_create_volume_with_qos[0m
[31m 2.01 SolidFireVolumeTestCase.test_create_volume[0m
[31m 2.01 SolidFireVolumeTestCase.test_create_with_qos_type[0m
[31m 1.31 ScalityDriverTestCase.test_delete_snapshot[0m
----------------------------------------------------------------------
Ran 1323 tests in 61.844s
FAILED (SKIP=52, errors=2)
ERROR: InvocationError: '<https://jenkins01.openstack.org/job/periodic-cinder-python27-stable-grizzly…'>
___________________________________ summary ____________________________________
ERROR: py27: commands failed
+ result=1
+ echo 'Begin pip freeze output from test virtualenv:'
Begin pip freeze output from test virtualenv:
+ echo ======================================================================
======================================================================
+ .tox/py27/bin/pip freeze
Babel==1.3
Jinja2==2.7.1
MarkupSafe==0.18
MySQL-python==1.2.4
Paste==1.7.5.1
PasteDeploy==1.5.0
Pygments==1.6
Routes==1.13
SQLAlchemy==0.7.9
Sphinx==1.1.3
Tempita==0.5.1
WebOb==1.2.3
amqp==1.0.13
amqplib==1.0.2
anyjson==0.3.3
argparse==1.2.1
cinder==jenkins.periodic.cinder.python27.stable.grizzly.3
colorama==0.2.5
coverage==3.6
d2to1==0.2.10
decorator==3.4.0
distribute==0.7.3
docutils==0.10
eventlet==0.13.0
greenlet==0.4.1
hp3parclient==1.0.0
httplib2==0.8
iso8601==0.1.4
jsonpatch==1.1
jsonpointer==1.0
jsonschema==2.0.0
kombu==2.5.12
lockfile==0.9.1
logilab-astng==0.24.3
logilab-common==0.60.0
lxml==3.2.3
mock==1.0.1
mox==0.5.3
nose==1.3.0
nosehtmloutput==0.0.5
nosexcover==1.0.8
openstack.nose-plugin==0.11
oslo.config==1.1.1
paramiko==1.11.0
pbr==0.5.21
pep8==1.3.3
prettytable==0.7.2
psycopg2==2.5.1
pyOpenSSL==0.13
pycrypto==2.6
pylint==0.25.2
python-glanceclient==0.10.0
python-keystoneclient==0.3.1
python-swiftclient==1.5.0
pytz==2013b
repoze.lru==0.6
requests==1.2.3
setuptools-git==1.0
simplejson==3.3.0
six==1.3.0
sqlalchemy-migrate==0.7.2
stevedore==0.10
suds==0.4
termcolor==1.1.0
warlock==1.0.1
wsgiref==0.1.2
+ echo ======================================================================
======================================================================
+ '[' -d .testrepository ']'
+ sudo /usr/local/jenkins/slave_scripts/jenkins-sudo-grep.sh post
+ sudoresult=0
+ '[' 0 -ne 0 ']'
+ /usr/local/jenkins/slave_scripts/jenkins-oom-grep.sh post
+ oomresult=0
+ '[' 0 -ne 0 ']'
++ find . -name nose_results.html
+ htmlreport=./nose_results.html
+ '[' -f ./nose_results.html ']'
++ grep -c 'tr class=.passClass' ./nose_results.html
+ passcount=178
+ '[' 178 -eq 0 ']'
+ exit 1
+ rm -rf /tmp/tmp.A5oEUlgB5z
Build step 'Execute shell' marked build as failure
[SCP] Connecting to static.openstack.org
[SCP] uploading file: '/srv/static/logs/periodic/periodic-cinder-python27-stable-grizzly/3/nose_results.html'
[SCP] Connecting to static.openstack.org
[SCP] Trying to create /srv/static/logs/periodic/periodic-cinder-python27-stable-grizzly/precise3
[SCP] Trying to create /srv/static/logs/periodic/periodic-cinder-python27-stable-grizzly/precise3/3
[SCP] Copying console log.
1
1
12 Aug '13
See <https://jenkins02.openstack.org/job/periodic-glance-python26-stable-grizzly…>
------------------------------------------
[...truncated 1166 lines...]
test_add_ignores_acls_if_no_locations [32mOK [0m[32m 0.00[0m
test_add_updates_acls [32mOK [0m[32m 0.00[0m
test_member_addition_updates_acls [32mOK [0m[32m 0.00[0m
test_member_removal_updates_acls [32mOK [0m[32m 0.00[0m
test_save_fetches_members_if_private [32mOK [0m[32m 0.00[0m
test_save_updates_acls [32mOK [0m[32m 0.00[0m
TestStoreLocation
test_bad_store_scheme [32mOK [0m[32m 0.01[0m
test_filesystem_store_location [32mOK [0m[32m 0.01[0m
test_get_location_from_uri_back_to_uri [32mOK [0m[32m 0.01[0m
test_get_store_from_scheme [32mOK [0m[32m 0.02[0m
test_http_store_location [32mOK [0m[32m 0.01[0m
test_rbd_store_location [32mOK [0m[32m 0.01[0m
test_s3_store_location [32mOK [0m[32m 0.01[0m
test_swift_store_location [32mOK [0m[32m 0.01[0m
TestChunkReader
test_read_all_data [32mOK [0m[32m 0.01[0m
TestCreatingLocations
test_multi_tenant_location [32mOK [0m[32m 0.01[0m
test_multi_tenant_location_custom_service_type [32mOK [0m[32m 0.01[0m
test_multi_tenant_location_http [32mOK [0m[32m 0.01[0m
test_multi_tenant_location_with_region [32mOK [0m[32m 0.01[0m
test_single_tenant_location [32mOK [0m[32m 0.01[0m
test_single_tenant_location_http [32mOK [0m[32m 0.01[0m
TestMultiTenantStoreConnections
test_basic_connection [32mOK [0m[32m 0.01[0m
test_connection_with_snet [32mOK [0m[32m 0.01[0m
TestSingleTenantStoreConnections
test_basic_connection [32mOK [0m[32m 0.01[0m
test_connection_invalid_user [32mOK [0m[32m 0.01[0m
test_connection_missing_user [32mOK [0m[32m 0.01[0m
test_connection_with_auth_v1 [32mOK [0m[32m 0.01[0m
test_connection_with_endpoint_type [32mOK [0m[32m 0.01[0m
test_connection_with_no_trailing_slash [32mOK [0m[32m 0.01[0m
test_connection_with_region [32mOK [0m[32m 0.01[0m
test_connection_with_service_type [32mOK [0m[32m 0.01[0m
test_connection_with_snet [32mOK [0m[32m 0.01[0m
TestStoreAuthV1
test_add [32mOK [0m[32m 0.01[0m
test_add_already_existing [32mOK [0m[32m 0.01[0m
test_add_auth_url_variations [32mOK [0m[32m 0.01[0m
test_add_large_object [32mOK [0m[32m 0.01[0m
test_add_large_object_zero_size [32mOK [0m[32m 0.01[0m
test_add_no_container_and_create [32mOK [0m[32m 0.01[0m
test_add_no_container_no_create [32mOK [0m[32m 0.00[0m
test_delete [32mOK [0m[32m 0.00[0m
test_delete_non_existing [32mOK [0m[32m 0.00[0m
test_get [32mOK [0m[32m 0.00[0m
test_get_non_existing [32mOK [0m[32m 0.00[0m
test_get_size [32mOK [0m[32m 0.00[0m
test_get_size_with_multi_tenant_on [32mOK [0m[32m 0.00[0m
test_get_with_http_auth [32mOK [0m[32m 0.01[0m
test_no_auth_address [32mOK [0m[32m 0.00[0m
test_no_key [32mOK [0m[32m 0.00[0m
test_no_user [32mOK [0m[32m 0.00[0m
test_read_acl_public [32mOK [0m[32m 0.01[0m
test_read_acl_tenants [32mOK [0m[32m 0.00[0m
test_read_write_public [32mOK [0m[32m 0.00[0m
TestStoreAuthV2
test_add [32mOK [0m[32m 0.01[0m
test_add_already_existing [32mOK [0m[32m 0.01[0m
test_add_auth_url_variations [32mOK [0m[32m 0.01[0m
test_add_large_object [32mOK [0m[32m 0.01[0m
test_add_large_object_zero_size [32mOK [0m[32m 0.01[0m
test_add_no_container_and_create [32mOK [0m[32m 0.01[0m
test_add_no_container_no_create [32mOK [0m[32m 0.00[0m
test_delete [32mOK [0m[32m 0.01[0m
test_delete_non_existing [32mOK [0m[32m 0.00[0m
test_get [32mOK [0m[32m 0.00[0m
test_get_non_existing [32mOK [0m[32m 0.00[0m
test_get_size [32mOK [0m[32m 0.00[0m
test_get_size_with_multi_tenant_on [32mOK [0m[32m 0.00[0m
test_get_with_http_auth [32mOK [0m[32m 0.00[0m
test_no_auth_address [32mOK [0m[32m 0.00[0m
test_no_key [32mOK [0m[32m 0.01[0m
test_no_user [32mOK [0m[32m 0.01[0m
test_read_acl_public [32mOK [0m[32m 0.00[0m
test_read_acl_tenants [32mOK [0m[32m 0.00[0m
test_read_write_public [32mOK [0m[32m 0.00[0m
test_v2_multi_tenant_location [32mOK [0m[32m 0.00[0m
test_v2_with_no_tenant [32mOK [0m[32m 0.00[0m
TestUtils
test_cooperative_reader [32mOK [0m[33m 0.04[0m
test_cooperative_reader_of_iterator [32mOK [0m[32m 0.00[0m
test_limiting_reader [32mOK [0m[32m 0.01[0m
test_limiting_reader_fails [32mOK [0m[32m 0.01[0m
VersionNegotiationTest
test_request_accept_v1 [32mOK [0m[32m 0.01[0m
test_request_url_v1 [32mOK [0m[32m 0.01[0m
test_request_url_v1_0 [32mOK [0m[32m 0.01[0m
test_request_url_v1_1 [32mOK [0m[32m 0.01[0m
test_request_url_v2 [32mOK [0m[32m 0.01[0m
test_request_url_v2_0 [32mOK [0m[32m 0.01[0m
test_request_url_v2_1 [32mOK [0m[32m 0.01[0m
test_request_url_v2_2_unsupported [32mOK [0m[32m 0.01[0m
test_request_url_v3_unsupported [32mOK [0m[32m 0.01[0m
VersionsTest
test_get_version_list [32mOK [0m[32m 0.01[0m
JSONRequestDeserializerTest
test_default_no_body [32mOK [0m[32m 0.00[0m
test_default_with_body [32mOK [0m[32m 0.00[0m
test_from_json [32mOK [0m[32m 0.00[0m
test_from_json_malformed [32mOK [0m[32m 0.00[0m
test_has_body_has_content_length [32mOK [0m[32m 0.00[0m
test_has_body_no_content_length [32mOK [0m[32m 0.00[0m
test_has_body_zero_content_length [32mOK [0m[32m 0.00[0m
test_no_body_no_content_length [32mOK [0m[32m 0.00[0m
JSONResponseSerializerTest
test_default [32mOK [0m[32m 0.00[0m
test_to_json [32mOK [0m[32m 0.00[0m
RequestTest
test_content_type_accept_default [32mOK [0m[32m 0.00[0m
test_content_type_from_accept_json [32mOK [0m[32m 0.00[0m
test_content_type_from_accept_json_xml_quality [32mOK [0m[32m 0.00[0m
test_content_type_from_accept_xml [32mOK [0m[32m 0.00[0m
test_content_type_from_accept_xml_json [32mOK [0m[32m 0.00[0m
test_content_type_missing [32mOK [0m[32m 0.00[0m
test_content_type_unsupported [32mOK [0m[32m 0.00[0m
test_content_type_with_charset [32mOK [0m[32m 0.00[0m
ResourceTest
test_dispatch [32mOK [0m[32m 0.00[0m
test_dispatch_default [32mOK [0m[32m 0.00[0m
test_dispatch_no_default [32mOK [0m[32m 0.00[0m
test_get_action_args [32mOK [0m[32m 0.00[0m
TestHelpers
test_data_passed_properly_through_headers [32mOK [0m[32m 0.00[0m
test_headers_are_unicode [32mOK [0m[32m 0.00[0m
======================================================================
FAIL: glance.tests.functional.v1.test_ssl.TestSSL.test_size_greater_2G_mysql
----------------------------------------------------------------------
_StringException: Traceback (most recent call last):
File "<https://jenkins02.openstack.org/job/periodic-glance-python26-stable-grizzly…",> line 121, in wrapped
func(*a, **kwargs)
File "<https://jenkins02.openstack.org/job/periodic-glance-python26-stable-grizzly…",> line 663, in test_size_greater_2G_mysql
self.assertEqual(response.status, 201)
File "<https://jenkins02.openstack.org/job/periodic-glance-python26-stable-grizzly…",> line 322, in assertEqual
self.assertThat(observed, matcher, message)
File "<https://jenkins02.openstack.org/job/periodic-glance-python26-stable-grizzly…",> line 417, in assertThat
raise MismatchError(matchee, matcher, mismatch, verbose)
MismatchError: 500 != 201
----------------------------------------------------------------------
XML: nosetests.xml
Slowest 5 tests took 91.05 secs:
[31m 26.50 TestScrubber.test_scrubber_app[0m
[31m 20.69 TestScrubber.test_delayed_delete[0m
[31m 14.84 TestGlanceControl.test_reload[0m
[31m 14.59 TestRootApi.test_version_configurations[0m
[31m 14.43 TestGlanceControl.test_respawn[0m
----------------------------------------------------------------------
Ran 1101 tests in 616.154s
FAILED (SKIP=38, failures=1)
ERROR: InvocationError: '<https://jenkins02.openstack.org/job/periodic-glance-python26-stable-grizzly…'>
___________________________________ summary ____________________________________
ERROR: py26: commands failed
+ result=1
+ echo 'Begin pip freeze output from test virtualenv:'
Begin pip freeze output from test virtualenv:
+ echo ======================================================================
======================================================================
+ .tox/py26/bin/pip freeze
Babel==1.3
Jinja2==2.7.1
MarkupSafe==0.18
MySQL-python==1.2.4
Paste==1.7.5.1
PasteDeploy==1.5.0
Pygments==1.6
Routes==1.13
SQLAlchemy==0.7.9
Sphinx==1.1.3
Tempita==0.5.1
WebOb==1.2.3
amqp==1.0.13
anyjson==0.3.3
argparse==1.2.1
boto==2.9.9
cffi==0.7.2
colorama==0.2.5
coverage==3.6
d2to1==0.2.10
decorator==3.4.0
distribute==0.7.3
docutils==0.10
eventlet==0.13.0
extras==0.0.3
fixtures==0.3.12
glance==jenkins.periodic.glance.python26.stable.grizzly.5
greenlet==0.4.1
httplib2==0.8
importlib==1.0.2
iso8601==0.1.4
jsonschema==2.0.0
kombu==2.5.12
lxml==3.2.3
mox==0.5.3
nose==1.3.0
nose-exclude==0.1.10
nosehtmloutput==0.0.5
openstack.nose-plugin==0.11
ordereddict==1.1
oslo.config==1.1.1
passlib==1.6.1
pbr==0.5.21
pep8==1.3.3
prettytable==0.7.2
psycopg2==2.5.1
pycparser==2.10
pycrypto==2.6
pysendfile==2.0.0
python-keystoneclient==0.3.1
python-mimeparse==0.1.4
python-swiftclient==1.5.0
pytz==2013b
repoze.lru==0.6
requests==1.2.3
simplejson==3.3.0
six==1.3.0
sqlalchemy-migrate==0.7.2
termcolor==1.1.0
testtools==0.9.32
wsgiref==0.1.2
xattr==0.7.2
+ echo ======================================================================
======================================================================
+ '[' -d .testrepository ']'
+ sudo /usr/local/jenkins/slave_scripts/jenkins-sudo-grep.sh post
+ sudoresult=0
+ '[' 0 -ne 0 ']'
+ /usr/local/jenkins/slave_scripts/jenkins-oom-grep.sh post
+ oomresult=0
+ '[' 0 -ne 0 ']'
++ find . -name nose_results.html
+ htmlreport=./nose_results.html
+ '[' -f ./nose_results.html ']'
++ grep -c 'tr class=.passClass' ./nose_results.html
+ passcount=126
+ '[' 126 -eq 0 ']'
+ exit 1
+ rm -rf /tmp/tmp.yNNGcLTNPh
Build step 'Execute shell' marked build as failure
[SCP] Connecting to static.openstack.org
[SCP] uploading file: '/srv/static/logs/periodic/periodic-glance-python26-stable-grizzly/5/nose_results.html'
[SCP] Connecting to static.openstack.org
[SCP] Trying to create /srv/static/logs/periodic/periodic-glance-python26-stable-grizzly/centos6-8/5
[SCP] Copying console log.
1
1
10 Aug '13
See <https://jenkins01.openstack.org/job/periodic-nova-python26-stable-folsom/2/>
------------------------------------------
[...truncated 4312 lines...]
test_unrescue [32mOK [0m[31m 0.58[0m
test_unrescue_not_in_rescue [32mOK [0m[31m 0.97[0m
XenAPIVolumeTestCase
test_attach_volume [32mOK [0m[31m 0.09[0m
test_attach_volume_raise_exception [32mOK [0m[31m 0.10[0m
test_mountpoint_to_number [32mOK [0m[31m 0.05[0m
test_parse_volume_info_raise_exception [32mOK [0m[31m 0.11[0m
XenSMTestCase
test_create_volume [32mOK [0m[31m 0.09[0m
test_delete_volume [32mOK [0m[31m 0.09[0m
test_delete_volume_raises_notfound [32mOK [0m[31m 0.07[0m
test_do_setup [32mOK [0m[31m 0.06[0m
test_initialize_connection [32mOK [0m[31m 0.09[0m
test_local_path [32mOK [0m[31m 0.09[0m
======================================================================
FAIL: test_terminate_sigterm (nova.tests.integrated.test_multiprocess_api.MultiprocessWSGITest)
----------------------------------------------------------------------
Traceback (most recent call last):
File "<https://jenkins01.openstack.org/job/periodic-nova-python26-stable-folsom/ws…",> line 166, in test_terminate_sigterm
self._terminate_with_signal(signal.SIGTERM)
File "<https://jenkins01.openstack.org/job/periodic-nova-python26-stable-folsom/ws…",> line 138, in _terminate_with_signal
self._spawn()
File "<https://jenkins01.openstack.org/job/periodic-nova-python26-stable-folsom/ws…",> line 85, in _spawn
self.assertEqual(len(workers), self.workers)
AssertionError: 1 != 2
>> raise self.failureException, \
(None or '%r != %r' % (1, 2))
-------------------- >> begin captured logging << --------------------
nova.compute.manager: INFO: Loading compute driver 'nova.virt.fake.FakeDriver'
nova.service: AUDIT: Starting compute node (version 2012.2.5-LOCALBRANCH:LOCALREVISION)
nova.compute.resource_tracker: AUDIT: Free ram (MB): 7680
nova.compute.resource_tracker: AUDIT: Free disk (GB): 1028
nova.compute.resource_tracker: AUDIT: Free VCPUS: 1
nova.compute.resource_tracker: INFO: Compute_service record created for 15d20e8b29874f0c94be6ba171bbd48f
nova.service: AUDIT: Starting volume node (version 2012.2.5-LOCALBRANCH:LOCALREVISION)
nova.service: AUDIT: Starting network node (version 2012.2.5-LOCALBRANCH:LOCALREVISION)
nova.service: AUDIT: Starting scheduler node (version 2012.2.5-LOCALBRANCH:LOCALREVISION)
nova.api.openstack.compute.extensions: AUDIT: Initializing extension manager.
nova.api.openstack.extensions: AUDIT: Loaded extension: os-cloudpipe
nova.api.openstack.extensions: AUDIT: Loaded extension: OS-DCF
nova.api.openstack.extensions: AUDIT: Loaded extension: OS-FLV-EXT-DATA
nova.api.openstack.extensions: AUDIT: Loaded extension: os-quota-class-sets
nova.api.openstack.extensions: AUDIT: Loaded extension: os-flavor-swap
nova.api.openstack.extensions: AUDIT: Loaded extension: NMN
nova.api.openstack.extensions: AUDIT: Loaded extension: os-floating-ip-pools
nova.api.openstack.extensions: AUDIT: Loaded extension: os-config-drive
nova.api.openstack.extensions: AUDIT: Loaded extension: OS-SCH-HNT
nova.api.openstack.extensions: AUDIT: Loaded extension: os-simple-tenant-usage
nova.api.openstack.extensions: AUDIT: Loaded extension: os-certificates
nova.api.openstack.extensions: AUDIT: Loaded extension: os-flavor-manage
nova.api.openstack.extensions: AUDIT: Loaded extension: os-security-groups
nova.api.openstack.extensions: AUDIT: Loaded extension: os-multiple-create
nova.api.openstack.extensions: AUDIT: Loaded extension: os-flavor-rxtx
nova.api.openstack.extensions: AUDIT: Loaded extension: os-floating-ips
nova.api.openstack.extensions: AUDIT: Loaded extension: os-volume-types
nova.api.openstack.extensions: AUDIT: Loaded extension: os-server-diagnostics
nova.api.openstack.extensions: AUDIT: Loaded extension: os-hosts
nova.api.openstack.extensions: AUDIT: Loaded extension: OS-EXT-STS
nova.api.openstack.extensions: AUDIT: Loaded extension: os-floating-ip-dns
nova.api.openstack.extensions: AUDIT: Loaded extension: os-aggregates
nova.api.openstack.extensions: AUDIT: Loaded extension: os-virtual-interfaces
nova.api.openstack.extensions: AUDIT: Loaded extension: os-networks
nova.api.openstack.extensions: AUDIT: Loaded extension: os-deferred-delete
nova.api.openstack.extensions: AUDIT: Loaded extension: OS-FLV-DISABLED
nova.api.openstack.extensions: AUDIT: Loaded extension: os-admin-actions
nova.api.openstack.extensions: AUDIT: Loaded extension: os-create-server-ext
nova.api.openstack.extensions: AUDIT: Loaded extension: os-availability-zone
nova.api.openstack.extensions: AUDIT: Loaded extension: os-instance_usage_audit_log
nova.api.openstack.extensions: AUDIT: Loaded extension: os-hypervisors
nova.api.openstack.extensions: AUDIT: Loaded extension: os-user-data
nova.api.openstack.extensions: AUDIT: Loaded extension: OS-EXT-SRV-ATTR
nova.api.openstack.extensions: AUDIT: Loaded extension: os-flavor-access
nova.api.openstack.extensions: AUDIT: Loaded extension: os-server-start-stop
nova.api.openstack.extensions: AUDIT: Loaded extension: os-console-output
nova.api.openstack.extensions: AUDIT: Loaded extension: os-rescue
nova.api.openstack.extensions: AUDIT: Loaded extension: os-flavor-extra-specs
nova.api.openstack.extensions: AUDIT: Loaded extension: os-keypairs
nova.api.openstack.extensions: AUDIT: Loaded extension: os-quota-sets
nova.api.openstack.extensions: AUDIT: Loaded extension: os-used-limits
nova.api.openstack.extensions: AUDIT: Loaded extension: os-consoles
nova.api.openstack.extensions: AUDIT: Loaded extension: os-volumes
routes.middleware: DEBUG: Initialized with method overriding = True, and path info altering = True
nova.api.openstack.compute.extensions: AUDIT: Initializing extension manager.
nova.api.openstack.extensions: AUDIT: Loaded extension: os-cloudpipe
nova.api.openstack.extensions: AUDIT: Loaded extension: OS-DCF
nova.api.openstack.extensions: AUDIT: Loaded extension: OS-FLV-EXT-DATA
nova.api.openstack.extensions: AUDIT: Loaded extension: os-quota-class-sets
nova.api.openstack.extensions: AUDIT: Loaded extension: os-flavor-swap
nova.api.openstack.extensions: AUDIT: Loaded extension: NMN
nova.api.openstack.extensions: AUDIT: Loaded extension: os-floating-ip-pools
nova.api.openstack.extensions: AUDIT: Loaded extension: os-config-drive
nova.api.openstack.extensions: AUDIT: Loaded extension: OS-SCH-HNT
nova.api.openstack.extensions: AUDIT: Loaded extension: os-simple-tenant-usage
nova.api.openstack.extensions: AUDIT: Loaded extension: os-certificates
nova.api.openstack.extensions: AUDIT: Loaded extension: os-flavor-manage
nova.api.openstack.extensions: AUDIT: Loaded extension: os-security-groups
nova.api.openstack.extensions: AUDIT: Loaded extension: os-multiple-create
nova.api.openstack.extensions: AUDIT: Loaded extension: os-flavor-rxtx
nova.api.openstack.extensions: AUDIT: Loaded extension: os-floating-ips
nova.api.openstack.extensions: AUDIT: Loaded extension: os-volume-types
nova.api.openstack.extensions: AUDIT: Loaded extension: os-server-diagnostics
nova.api.openstack.extensions: AUDIT: Loaded extension: os-hosts
nova.api.openstack.extensions: AUDIT: Loaded extension: OS-EXT-STS
nova.api.openstack.extensions: AUDIT: Loaded extension: os-floating-ip-dns
nova.api.openstack.extensions: AUDIT: Loaded extension: os-aggregates
nova.api.openstack.extensions: AUDIT: Loaded extension: os-virtual-interfaces
nova.api.openstack.extensions: AUDIT: Loaded extension: os-networks
nova.api.openstack.extensions: AUDIT: Loaded extension: os-deferred-delete
nova.api.openstack.extensions: AUDIT: Loaded extension: OS-FLV-DISABLED
nova.api.openstack.extensions: AUDIT: Loaded extension: os-admin-actions
nova.api.openstack.extensions: AUDIT: Loaded extension: os-create-server-ext
nova.api.openstack.extensions: AUDIT: Loaded extension: os-availability-zone
nova.api.openstack.extensions: AUDIT: Loaded extension: os-instance_usage_audit_log
nova.api.openstack.extensions: AUDIT: Loaded extension: os-hypervisors
nova.api.openstack.extensions: AUDIT: Loaded extension: os-user-data
nova.api.openstack.extensions: AUDIT: Loaded extension: OS-EXT-SRV-ATTR
nova.api.openstack.extensions: AUDIT: Loaded extension: os-flavor-access
nova.api.openstack.extensions: AUDIT: Loaded extension: os-server-start-stop
nova.api.openstack.extensions: AUDIT: Loaded extension: os-console-output
nova.api.openstack.extensions: AUDIT: Loaded extension: os-rescue
nova.api.openstack.extensions: AUDIT: Loaded extension: os-flavor-extra-specs
nova.api.openstack.extensions: AUDIT: Loaded extension: os-keypairs
nova.api.openstack.extensions: AUDIT: Loaded extension: os-quota-sets
nova.api.openstack.extensions: AUDIT: Loaded extension: os-used-limits
nova.api.openstack.extensions: AUDIT: Loaded extension: os-consoles
nova.api.openstack.extensions: AUDIT: Loaded extension: os-volumes
routes.middleware: DEBUG: Initialized with method overriding = True, and path info altering = True
nova.wsgi: INFO: osapi_compute listening on 127.0.0.1:45911
nova.tests.integrated.test_multiprocess_api: INFO: auth_url = http://127.0.0.1:45911/v2
nova.compute.resource_tracker: AUDIT: Free ram (MB): 7680
nova.compute.resource_tracker: AUDIT: Free disk (GB): 1028
nova.compute.resource_tracker: AUDIT: Free VCPUS: 1
nova.compute.resource_tracker: INFO: Compute_service record updated for 15d20e8b29874f0c94be6ba171bbd48f
--------------------- >> end captured logging << ---------------------
----------------------------------------------------------------------
XML: nosetests.xml
Slowest 5 tests took 33.51 secs:
[31m 10.81 ComputeTestCase.test_state_revert[0m
[31m 7.12 CloudTestCase.test_instance_initiated_shutdown_behavior[0m
[31m 6.10 ServersTest.test_create_multiple_servers[0m
[31m 5.08 StorwizeSVCDriverTestCase.test_storwize_svc_flashcopy[0m
[31m 4.40 ServersTest.test_create_and_rebuild_server[0m
----------------------------------------------------------------------
Ran 3728 tests in 837.654s
FAILED (SKIP=7, failures=1)
ERROR: InvocationError: '<https://jenkins01.openstack.org/job/periodic-nova-python26-stable-folsom/ws…'>
___________________________________ summary ____________________________________
ERROR: py26: commands failed
+ result=1
+ echo 'Begin pip freeze output from test virtualenv:'
Begin pip freeze output from test virtualenv:
+ echo ======================================================================
======================================================================
+ .tox/py26/bin/pip freeze
Babel==1.3
Cheetah==2.4.4
Jinja2==2.7.1
Markdown==2.3.1
MarkupSafe==0.18
Paste==1.7.5.1
PasteDeploy==1.5.0
Pygments==1.6
Routes==1.12.3
SQLAlchemy==0.7.9
Sphinx==1.1.3
Tempita==0.5.1
WebOb==1.0.8
amqplib==0.6.1
anyjson==0.2.4
argparse==1.2.1
boto==2.1.1
cliff==1.4
cmd2==0.6.6
colorama==0.2.5
coverage==3.6
d2to1==0.2.10
decorator==3.4.0
distribute==0.7.3
docutils==0.10
eventlet==0.13.0
feedparser==5.1.3
greenlet==0.4.1
httplib2==0.8
iso8601==0.1.4
jsonpatch==1.1
jsonpointer==1.0
jsonschema==2.0.0
kombu==1.0.4
logilab-astng==0.24.3
logilab-common==0.60.0
lxml==2.3.5
mox==0.5.3
netaddr==0.7.10
nose==1.2.1
nosehtmloutput==0.0.4
nova==2012.2.5
openstack.nose-plugin==0.11
oslo.config==1.1.1
paramiko==1.11.0
pbr==0.5.21
pep8==1.1
prettytable==0.7.2
pyOpenSSL==0.13
pycrypto==2.6
pylint==0.25.2
pyparsing==1.5.7
python-cinderclient==1.0.5
python-glanceclient==0.9.0
python-keystoneclient==0.3.1
python-quantumclient==2.2.3
pytz==2013b
requests==1.2.2
setuptools-git==1.0
simplejson==3.3.0
six==1.3.0
sqlalchemy-migrate==0.7.2
suds==0.4
termcolor==1.1.0
unittest2==0.5.1
warlock==1.0.1
+ echo ======================================================================
======================================================================
+ '[' -d .testrepository ']'
+ sudo /usr/local/jenkins/slave_scripts/jenkins-sudo-grep.sh post
+ sudoresult=0
+ '[' 0 -ne 0 ']'
+ /usr/local/jenkins/slave_scripts/jenkins-oom-grep.sh post
+ oomresult=0
+ '[' 0 -ne 0 ']'
++ find . -name nose_results.html
+ htmlreport=./nova/tests/nose_results.html
+ '[' -f ./nova/tests/nose_results.html ']'
++ grep -c 'tr class=.passClass' ./nova/tests/nose_results.html
+ passcount=459
+ '[' 459 -eq 0 ']'
+ exit 1
+ rm -rf /tmp/tmp.1OTVqHrnVW
Build step 'Execute shell' marked build as failure
[SCP] Connecting to static.openstack.org
[SCP] Trying to create /srv/static/logs/periodic/periodic-nova-python26-stable-folsom/2
[SCP] uploading file: '/srv/static/logs/periodic/periodic-nova-python26-stable-folsom/2/nose_results.html'
[SCP] Connecting to static.openstack.org
[SCP] Trying to create /srv/static/logs/periodic/periodic-nova-python26-stable-folsom/centos6-11
[SCP] Trying to create /srv/static/logs/periodic/periodic-nova-python26-stable-folsom/centos6-11/2
[SCP] Copying console log.
1
1
Build failed in Jenkins: periodic-tempest-devstack-vm-postgres-stable-grizzly #1
by OpenStack Jenkins 09 Aug '13
by OpenStack Jenkins 09 Aug '13
09 Aug '13
See <https://jenkins02.openstack.org/job/periodic-tempest-devstack-vm-postgres-s…>
------------------------------------------
Started by user anonymous
[EnvInject] - Loading node environment variables.
Building remotely on devstack-precise-hpcloud-az1-67 in workspace <https://jenkins02.openstack.org/job/periodic-tempest-devstack-vm-postgres-s…>
Waiting for the completion of devstack-update-inprogress
devstack-update-inprogress #78 completed. Result was SUCCESS
Build step 'Trigger/call builds on other projects' changed build result to SUCCESS
[periodic-tempest-devstack-vm-postgres-stable-grizzly] $ /bin/bash -xe /tmp/hudson3602485014762590234.sh
+ [[ ! -e devstack-gate ]]
+ git clone https://review.openstack.org/p/openstack-infra/devstack-gate
Cloning into 'devstack-gate'...
[periodic-tempest-devstack-vm-postgres-stable-grizzly] $ /bin/bash -xe /tmp/hudson7684513765658204426.sh
+ export PYTHONUNBUFFERED=true
+ PYTHONUNBUFFERED=true
+ export DEVSTACK_GATE_TEMPEST=1
+ DEVSTACK_GATE_TEMPEST=1
+ export DEVSTACK_GATE_POSTGRES=1
+ DEVSTACK_GATE_POSTGRES=1
+ export DEVSTACK_GATE_TEMPEST_FULL=1
+ DEVSTACK_GATE_TEMPEST_FULL=1
+ export ZUUL_BRANCH=stable/grizzly
+ ZUUL_BRANCH=stable/grizzly
+ cp devstack-gate/devstack-vm-gate-wrap.sh ./safe-devstack-vm-gate-wrap.sh
+ ./safe-devstack-vm-gate-wrap.sh
Build step 'Execute shell' marked build as failure
[SCP] Connecting to static.openstack.org
[SCP] Trying to create /srv/static/logs/periodic/periodic-tempest-devstack-vm-postgres-stable-grizzly/devstack-precise-hpcloud-az1-67
[SCP] Trying to create /srv/static/logs/periodic/periodic-tempest-devstack-vm-postgres-stable-grizzly/devstack-precise-hpcloud-az1-67/1
[SCP] Trying to create /srv/static/logs/periodic/periodic-tempest-devstack-vm-postgres-stable-grizzly/devstack-precise-hpcloud-az1-67/1/logs
[SCP] uploading file: '/srv/static/logs/periodic/periodic-tempest-devstack-vm-postgres-stable-grizzly/devstack-precise-hpcloud-az1-67/1/logs/devstack-gate-setup-workspace-new.txt'
[SCP] No file(s) found: **/testr_results.html.gz
[SCP] '**/testr_results.html.gz' doesn't match anything: '**' exists but not '**/testr_results.html.gz'
[SCP] No file(s) found: **/subunit_log.txt.gz
[SCP] '**/subunit_log.txt.gz' doesn't match anything: '**' exists but not '**/subunit_log.txt.gz'
[SCP] Connecting to static.openstack.org
[SCP] Copying console log.
1
2
Build failed in Jenkins: periodic-ceilometer-python27-stable-grizzly #2
by OpenStack Jenkins 09 Aug '13
by OpenStack Jenkins 09 Aug '13
09 Aug '13
See <https://jenkins01.openstack.org/job/periodic-ceilometer-python27-stable-gri…>
------------------------------------------
[...truncated 6124 lines...]
File "<https://jenkins01.openstack.org/job/periodic-ceilometer-python27-stable-gri…",> line 52, in _load_one_plugin
ep, invoke_on_load, invoke_args, invoke_kwds,
File "<https://jenkins01.openstack.org/job/periodic-ceilometer-python27-stable-gri…",> line 101, in _load_one_plugin
plugin = ep.load()
File "<https://jenkins01.openstack.org/job/periodic-ceilometer-python27-stable-gri…",> line 2259, in load
if require: self.require(env, installer)
File "<https://jenkins01.openstack.org/job/periodic-ceilometer-python27-stable-gri…",> line 2272, in require
working_set.resolve(self.dist.requires(self.extras),env,installer)))
File "<https://jenkins01.openstack.org/job/periodic-ceilometer-python27-stable-gri…",> line 630, in resolve
raise VersionConflict(dist,req) # XXX put more info here
VersionConflict: (requests 1.2.3 (<https://jenkins01.openstack.org/job/periodic-ceilometer-python27-stable-gri…)> Requirement.parse('requests>=1.1,<1.2.3'))
stevedore.extension: DEBUG: found extension EntryPoint.parse('image = ceilometer.image.glance:ImagePollster')
stevedore.extension: ERROR: Could not load 'image': (requests 1.2.3 (<https://jenkins01.openstack.org/job/periodic-ceilometer-python27-stable-gri…)> Requirement.parse('requests>=1.1,<1.2.3'))
stevedore.extension: ERROR: (requests 1.2.3 (<https://jenkins01.openstack.org/job/periodic-ceilometer-python27-stable-gri…)> Requirement.parse('requests>=1.1,<1.2.3'))
Traceback (most recent call last):
File "<https://jenkins01.openstack.org/job/periodic-ceilometer-python27-stable-gri…",> line 89, in _load_plugins
invoke_kwds,
File "<https://jenkins01.openstack.org/job/periodic-ceilometer-python27-stable-gri…",> line 52, in _load_one_plugin
ep, invoke_on_load, invoke_args, invoke_kwds,
File "<https://jenkins01.openstack.org/job/periodic-ceilometer-python27-stable-gri…",> line 101, in _load_one_plugin
plugin = ep.load()
File "<https://jenkins01.openstack.org/job/periodic-ceilometer-python27-stable-gri…",> line 2259, in load
if require: self.require(env, installer)
File "<https://jenkins01.openstack.org/job/periodic-ceilometer-python27-stable-gri…",> line 2272, in require
working_set.resolve(self.dist.requires(self.extras),env,installer)))
File "<https://jenkins01.openstack.org/job/periodic-ceilometer-python27-stable-gri…",> line 630, in resolve
raise VersionConflict(dist,req) # XXX put more info here
VersionConflict: (requests 1.2.3 (<https://jenkins01.openstack.org/job/periodic-ceilometer-python27-stable-gri…)> Requirement.parse('requests>=1.1,<1.2.3'))
stevedore.extension: DEBUG: found extension EntryPoint.parse('kwapi = ceilometer.energy.kwapi:KwapiPollster')
stevedore.extension: ERROR: Could not load 'kwapi': (requests 1.2.3 (<https://jenkins01.openstack.org/job/periodic-ceilometer-python27-stable-gri…)> Requirement.parse('requests>=1.1,<1.2.3'))
stevedore.extension: ERROR: (requests 1.2.3 (<https://jenkins01.openstack.org/job/periodic-ceilometer-python27-stable-gri…)> Requirement.parse('requests>=1.1,<1.2.3'))
Traceback (most recent call last):
File "<https://jenkins01.openstack.org/job/periodic-ceilometer-python27-stable-gri…",> line 89, in _load_plugins
invoke_kwds,
File "<https://jenkins01.openstack.org/job/periodic-ceilometer-python27-stable-gri…",> line 52, in _load_one_plugin
ep, invoke_on_load, invoke_args, invoke_kwds,
File "<https://jenkins01.openstack.org/job/periodic-ceilometer-python27-stable-gri…",> line 101, in _load_one_plugin
plugin = ep.load()
File "<https://jenkins01.openstack.org/job/periodic-ceilometer-python27-stable-gri…",> line 2259, in load
if require: self.require(env, installer)
File "<https://jenkins01.openstack.org/job/periodic-ceilometer-python27-stable-gri…",> line 2272, in require
working_set.resolve(self.dist.requires(self.extras),env,installer)))
File "<https://jenkins01.openstack.org/job/periodic-ceilometer-python27-stable-gri…",> line 630, in resolve
raise VersionConflict(dist,req) # XXX put more info here
VersionConflict: (requests 1.2.3 (<https://jenkins01.openstack.org/job/periodic-ceilometer-python27-stable-gri…)> Requirement.parse('requests>=1.1,<1.2.3'))
stevedore.extension: DEBUG: found extension EntryPoint.parse('meter_publisher = ceilometer.publisher.meter_publish:MeterPublisher')
stevedore.extension: ERROR: Could not load 'meter_publisher': (requests 1.2.3 (<https://jenkins01.openstack.org/job/periodic-ceilometer-python27-stable-gri…)> Requirement.parse('requests>=1.1,<1.2.3'))
stevedore.extension: ERROR: (requests 1.2.3 (<https://jenkins01.openstack.org/job/periodic-ceilometer-python27-stable-gri…)> Requirement.parse('requests>=1.1,<1.2.3'))
Traceback (most recent call last):
File "<https://jenkins01.openstack.org/job/periodic-ceilometer-python27-stable-gri…",> line 89, in _load_plugins
invoke_kwds,
File "<https://jenkins01.openstack.org/job/periodic-ceilometer-python27-stable-gri…",> line 52, in _load_one_plugin
ep, invoke_on_load, invoke_args, invoke_kwds,
File "<https://jenkins01.openstack.org/job/periodic-ceilometer-python27-stable-gri…",> line 101, in _load_one_plugin
plugin = ep.load()
File "<https://jenkins01.openstack.org/job/periodic-ceilometer-python27-stable-gri…",> line 2259, in load
if require: self.require(env, installer)
File "<https://jenkins01.openstack.org/job/periodic-ceilometer-python27-stable-gri…",> line 2272, in require
working_set.resolve(self.dist.requires(self.extras),env,installer)))
File "<https://jenkins01.openstack.org/job/periodic-ceilometer-python27-stable-gri…",> line 630, in resolve
raise VersionConflict(dist,req) # XXX put more info here
VersionConflict: (requests 1.2.3 (<https://jenkins01.openstack.org/job/periodic-ceilometer-python27-stable-gri…)> Requirement.parse('requests>=1.1,<1.2.3'))
--------------------- >> end captured logging << ---------------------
======================================================================
FAIL: test_v1 (tests.test_bin.BinApiTestCase)
----------------------------------------------------------------------
Traceback (most recent call last):
File "<https://jenkins01.openstack.org/job/periodic-ceilometer-python27-stable-gri…",> line 106, in test_v1
response, content = self.get_response('v1/meters')
File "<https://jenkins01.openstack.org/job/periodic-ceilometer-python27-stable-gri…",> line 101, in get_response
self.assertEqual(self.subp.poll(), None)
AssertionError: 1 != None
'1 != None' = '%s != %s' % (safe_repr(1), safe_repr(None))
'1 != None' = self._formatMessage('1 != None', '1 != None')
>> raise self.failureException('1 != None')
======================================================================
FAIL: test_v2 (tests.test_bin.BinApiTestCase)
----------------------------------------------------------------------
Traceback (most recent call last):
File "<https://jenkins01.openstack.org/job/periodic-ceilometer-python27-stable-gri…",> line 111, in test_v2
response, content = self.get_response('v2/meters')
File "<https://jenkins01.openstack.org/job/periodic-ceilometer-python27-stable-gri…",> line 101, in get_response
self.assertEqual(self.subp.poll(), None)
AssertionError: 1 != None
'1 != None' = '%s != %s' % (safe_repr(1), safe_repr(None))
'1 != None' = self._formatMessage('1 != None', '1 != None')
>> raise self.failureException('1 != None')
======================================================================
FAIL: test_dbsync_run (tests.test_bin.BinDbsyncTestCase)
----------------------------------------------------------------------
Traceback (most recent call last):
File "<https://jenkins01.openstack.org/job/periodic-ceilometer-python27-stable-gri…",> line 41, in test_dbsync_run
self.assertEqual(subp.wait(), 0)
AssertionError: 1 != 0
'1 != 0' = '%s != %s' % (safe_repr(1), safe_repr(0))
'1 != 0' = self._formatMessage('1 != 0', '1 != 0')
>> raise self.failureException('1 != 0')
======================================================================
FAIL: test_send_counter_run (tests.test_bin.BinSendCounterTestCase)
----------------------------------------------------------------------
Traceback (most recent call last):
File "<https://jenkins01.openstack.org/job/periodic-ceilometer-python27-stable-gri…",> line 62, in test_send_counter_run
self.assertEqual(subp.wait(), 0)
AssertionError: 1 != 0
'1 != 0' = '%s != %s' % (safe_repr(1), safe_repr(0))
'1 != 0' = self._formatMessage('1 != 0', '1 != 0')
>> raise self.failureException('1 != 0')
----------------------------------------------------------------------
XML: nosetests.xml
----------------------------------------------------------------------
Ran 397 tests in 11.727s
FAILED (SKIP=66, errors=30, failures=5)
ERROR: InvocationError: '<https://jenkins01.openstack.org/job/periodic-ceilometer-python27-stable-gri…> --no-path-adjustment'
___________________________________ summary ____________________________________
ERROR: py27: commands failed
+ result=1
+ echo 'Begin pip freeze output from test virtualenv:'
Begin pip freeze output from test virtualenv:
+ echo ======================================================================
======================================================================
+ .tox/py27/bin/pip freeze
Babel==1.3
Cheetah==2.4.4
Flask==0.9
Jinja2==2.7
Mako==0.8.1
Markdown==2.3.1
MarkupSafe==0.18
Paste==1.7.5.1
PasteDeploy==1.5.0
PyYAML==3.10
Pygments==1.6
Routes==1.13
SQLAlchemy==0.7.10
Sphinx==1.1.3
Tempita==0.5.1
WSME==0.5b2
WebOb==1.2.3
WebTest==2.0.6
Werkzeug==0.9.3
amqp==1.0.13
amqplib==1.0.2
anyjson==0.3.3
argparse==1.2.1
beautifulsoup4==4.2.1
boto==2.9.9
ceilometer==jenkins.periodic.ceilometer.python27.stable.grizzly.2
cffi==0.7.2
cliff==1.4
cmd2==0.6.6
coverage==3.6
d2to1==0.2.10
decorator==3.4.0
dnspython==1.11.0
docutils==0.9.1
eventlet==0.13.0
extras==0.0.3
glance==2013.1
greenlet==0.4.1
happybase==0.6
httplib2==0.8
iso8601==0.1.4
jsonpatch==1.1
jsonpointer==1.0
jsonschema==2.0.0
kombu==2.5.12
lxml==3.2.3
mock==1.0.1
mox==0.5.3
netaddr==0.7.10
netifaces==0.8
nose==1.3.0
nova==2013.1
numpy==1.7.1
oslo.config==1.1.1
paramiko==1.11.0
passlib==1.6.1
pbr==0.5.21
pecan==0.3.1
prettytable==0.7.2
pyOpenSSL==0.13
pyasn1==0.1.7
pycparser==2.10
pycrypto==2.6
pymongo==2.5.2
pyparsing==1.5.7
python-cinderclient==1.0.5
python-glanceclient==0.9.0
python-keystoneclient==0.3.1
python-novaclient==2.14.0
python-quantumclient==2.2.3
python-spidermonkey==0.0.10
python-swiftclient==1.5.0
pytz==2013b
repoze.lru==0.6
requests==1.2.3
setuptools-git==1.0
simplegeneric==0.8.1
simplejson==3.3.0
six==1.3.0
sqlalchemy-migrate==0.7.2
stevedore==0.10
suds==0.4
swift==1.9.0
thrift==0.9.0
unittest2==0.5.1
waitress==0.8.5
warlock==1.0.1
websockify==0.3.0
wsgiref==0.1.2
xattr==0.7.2
+ echo ======================================================================
======================================================================
+ '[' -d .testrepository ']'
+ sudo /usr/local/jenkins/slave_scripts/jenkins-sudo-grep.sh post
+ sudoresult=0
+ '[' 0 -ne 0 ']'
+ /usr/local/jenkins/slave_scripts/jenkins-oom-grep.sh post
+ oomresult=0
+ '[' 0 -ne 0 ']'
++ find . -name nose_results.html
+ htmlreport=
+ '[' -f '' ']'
+ echo
+ echo 'WARNING: Unable to find to confirm results!'
WARNING: Unable to find to confirm results!
+ echo
+ exit 1
+ rm -rf /tmp/tmp.UrWbvk49LI
Build step 'Execute shell' marked build as failure
[SCP] Connecting to static.openstack.org
[SCP] No file(s) found: **/*nose_results.html
[SCP] '**/*nose_results.html' doesn't match anything: '**' exists but not '**/*nose_results.html'
[SCP] Connecting to static.openstack.org
[SCP] Trying to create /srv/static/logs/periodic/periodic-ceilometer-python27-stable-grizzly/precise7
[SCP] Trying to create /srv/static/logs/periodic/periodic-ceilometer-python27-stable-grizzly/precise7/2
[SCP] Copying console log.
1
1
Hi,
I would like to propose Aaron to be a stable maintainer. Over the course of the Grizzly and Havana cycles he has done a ton of work with the Neutron backports. He has also be very involved in the review process and would be a good addition to the team.
Thanks
Gary
7
8
Build failed in Jenkins: periodic-tempest-devstack-vm-neutron-stable-grizzly #1
by OpenStack Jenkins 08 Aug '13
by OpenStack Jenkins 08 Aug '13
08 Aug '13
See <https://jenkins01.openstack.org/job/periodic-tempest-devstack-vm-neutron-st…>
------------------------------------------
Started by user anonymous
[EnvInject] - Loading node environment variables.
Building remotely on devstack-precise-hpcloud-az2-77 in workspace <https://jenkins01.openstack.org/job/periodic-tempest-devstack-vm-neutron-st…>
Waiting for the completion of devstack-update-inprogress
devstack-update-inprogress #92 completed. Result was SUCCESS
Build step 'Trigger/call builds on other projects' changed build result to SUCCESS
[periodic-tempest-devstack-vm-neutron-stable-grizzly] $ /bin/bash -xe /tmp/hudson4045670116651255639.sh
+ [[ ! -e devstack-gate ]]
+ git clone https://review.openstack.org/p/openstack-infra/devstack-gate
Cloning into 'devstack-gate'...
[periodic-tempest-devstack-vm-neutron-stable-grizzly] $ /bin/bash -xe /tmp/hudson3909988965052039584.sh
+ export PYTHONUNBUFFERED=true
+ PYTHONUNBUFFERED=true
+ export DEVSTACK_GATE_TEMPEST=1
+ DEVSTACK_GATE_TEMPEST=1
+ export DEVSTACK_GATE_NEUTRON=1
+ DEVSTACK_GATE_NEUTRON=1
+ export ZUUL_BRANCH=stable/grizzly
+ ZUUL_BRANCH=stable/grizzly
+ cp devstack-gate/devstack-vm-gate-wrap.sh ./safe-devstack-vm-gate-wrap.sh
+ ./safe-devstack-vm-gate-wrap.sh
Build step 'Execute shell' marked build as failure
[SCP] Connecting to static.openstack.org
[SCP] Trying to create /srv/static/logs/periodic/periodic-tempest-devstack-vm-neutron-stable-grizzly/devstack-precise-hpcloud-az2-77
[SCP] Trying to create /srv/static/logs/periodic/periodic-tempest-devstack-vm-neutron-stable-grizzly/devstack-precise-hpcloud-az2-77/1
[SCP] Trying to create /srv/static/logs/periodic/periodic-tempest-devstack-vm-neutron-stable-grizzly/devstack-precise-hpcloud-az2-77/1/logs
[SCP] uploading file: '/srv/static/logs/periodic/periodic-tempest-devstack-vm-neutron-stable-grizzly/devstack-precise-hpcloud-az2-77/1/logs/devstack-gate-setup-workspace-new.txt'
[SCP] No file(s) found: **/testr_results.html.gz
[SCP] '**/testr_results.html.gz' doesn't match anything: '**' exists but not '**/testr_results.html.gz'
[SCP] No file(s) found: **/subunit_log.txt.gz
[SCP] '**/subunit_log.txt.gz' doesn't match anything: '**' exists but not '**/subunit_log.txt.gz'
[SCP] Connecting to static.openstack.org
[SCP] Copying console log.
1
2
Build failed in Jenkins: periodic-tempest-devstack-vm-stable-grizzly #1
by OpenStack Jenkins 07 Aug '13
by OpenStack Jenkins 07 Aug '13
07 Aug '13
See <https://jenkins01.openstack.org/job/periodic-tempest-devstack-vm-stable-gri…>
------------------------------------------
Started by user anonymous
[EnvInject] - Loading node environment variables.
Building remotely on devstack-precise-hpcloud-az3-100 in workspace <https://jenkins01.openstack.org/job/periodic-tempest-devstack-vm-stable-gri…>
Waiting for the completion of devstack-update-inprogress
devstack-update-inprogress #94 completed. Result was SUCCESS
Build step 'Trigger/call builds on other projects' changed build result to SUCCESS
[periodic-tempest-devstack-vm-stable-grizzly] $ /bin/bash -xe /tmp/hudson5550466818240925186.sh
+ [[ ! -e devstack-gate ]]
+ git clone https://review.openstack.org/p/openstack-infra/devstack-gate
Cloning into 'devstack-gate'...
[periodic-tempest-devstack-vm-stable-grizzly] $ /bin/bash -xe /tmp/hudson2088553421140863125.sh
+ export PYTHONUNBUFFERED=true
+ PYTHONUNBUFFERED=true
+ export DEVSTACK_GATE_TEMPEST=1
+ DEVSTACK_GATE_TEMPEST=1
+ export DEVSTACK_GATE_TEMPEST_FULL=1
+ DEVSTACK_GATE_TEMPEST_FULL=1
+ export ZUUL_BRANCH=stable/grizzly
+ ZUUL_BRANCH=stable/grizzly
+ cp devstack-gate/devstack-vm-gate-wrap.sh ./safe-devstack-vm-gate-wrap.sh
+ ./safe-devstack-vm-gate-wrap.sh
Build step 'Execute shell' marked build as failure
[SCP] Connecting to static.openstack.org
[SCP] Trying to create /srv/static/logs/periodic/periodic-tempest-devstack-vm-stable-grizzly/devstack-precise-hpcloud-az3-100
[SCP] Trying to create /srv/static/logs/periodic/periodic-tempest-devstack-vm-stable-grizzly/devstack-precise-hpcloud-az3-100/1
[SCP] Trying to create /srv/static/logs/periodic/periodic-tempest-devstack-vm-stable-grizzly/devstack-precise-hpcloud-az3-100/1/logs
[SCP] uploading file: '/srv/static/logs/periodic/periodic-tempest-devstack-vm-stable-grizzly/devstack-precise-hpcloud-az3-100/1/logs/devstack-gate-setup-workspace-new.txt'
[SCP] No file(s) found: **/testr_results.html.gz
[SCP] '**/testr_results.html.gz' doesn't match anything: '**' exists but not '**/testr_results.html.gz'
[SCP] No file(s) found: **/subunit_log.txt.gz
[SCP] '**/subunit_log.txt.gz' doesn't match anything: '**' exists but not '**/subunit_log.txt.gz'
[SCP] Connecting to static.openstack.org
[SCP] Copying console log.
1
2
Build failed in Jenkins: periodic-tempest-devstack-vm-cinder-stable-folsom #1
by OpenStack Jenkins 07 Aug '13
by OpenStack Jenkins 07 Aug '13
07 Aug '13
See <https://jenkins01.openstack.org/job/periodic-tempest-devstack-vm-cinder-sta…>
------------------------------------------
Started by user anonymous
[EnvInject] - Loading node environment variables.
Building remotely on devstack-precise-hpcloud-az1-92 in workspace <https://jenkins01.openstack.org/job/periodic-tempest-devstack-vm-cinder-sta…>
Waiting for the completion of devstack-update-inprogress
devstack-update-inprogress #93 completed. Result was SUCCESS
Build step 'Trigger/call builds on other projects' changed build result to SUCCESS
[periodic-tempest-devstack-vm-cinder-stable-folsom] $ /bin/bash -xe /tmp/hudson7231838392554393327.sh
+ [[ ! -e devstack-gate ]]
+ git clone https://review.openstack.org/p/openstack-infra/devstack-gate
Cloning into 'devstack-gate'...
[periodic-tempest-devstack-vm-cinder-stable-folsom] $ /bin/bash -xe /tmp/hudson3217463266800712848.sh
+ export PYTHONUNBUFFERED=true
+ PYTHONUNBUFFERED=true
+ export DEVSTACK_GATE_TEMPEST=1
+ DEVSTACK_GATE_TEMPEST=1
+ export DEVSTACK_GATE_CINDER=1
+ DEVSTACK_GATE_CINDER=1
+ export ZUUL_BRANCH=stable/folsom
+ ZUUL_BRANCH=stable/folsom
+ cp devstack-gate/devstack-vm-gate-wrap.sh ./safe-devstack-vm-gate-wrap.sh
+ ./safe-devstack-vm-gate-wrap.sh
Build step 'Execute shell' marked build as failure
[SCP] Connecting to static.openstack.org
[SCP] Trying to create /srv/static/logs/periodic/periodic-tempest-devstack-vm-cinder-stable-folsom/devstack-precise-hpcloud-az1-92
[SCP] Trying to create /srv/static/logs/periodic/periodic-tempest-devstack-vm-cinder-stable-folsom/devstack-precise-hpcloud-az1-92/1
[SCP] Trying to create /srv/static/logs/periodic/periodic-tempest-devstack-vm-cinder-stable-folsom/devstack-precise-hpcloud-az1-92/1/logs
[SCP] uploading file: '/srv/static/logs/periodic/periodic-tempest-devstack-vm-cinder-stable-folsom/devstack-precise-hpcloud-az1-92/1/logs/devstack-gate-setup-workspace-new.txt'
[SCP] No file(s) found: **/testr_results.html.gz
[SCP] '**/testr_results.html.gz' doesn't match anything: '**' exists but not '**/testr_results.html.gz'
[SCP] No file(s) found: **/subunit_log.txt.gz
[SCP] '**/subunit_log.txt.gz' doesn't match anything: '**' exists but not '**/subunit_log.txt.gz'
[SCP] Connecting to static.openstack.org
[SCP] Copying console log.
1
2
Build failed in Jenkins: periodic-tempest-devstack-vm-stable-folsom #1
by OpenStack Jenkins 07 Aug '13
by OpenStack Jenkins 07 Aug '13
07 Aug '13
See <https://jenkins01.openstack.org/job/periodic-tempest-devstack-vm-stable-fol…>
------------------------------------------
Started by user anonymous
[EnvInject] - Loading node environment variables.
Building remotely on devstack-precise-hpcloud-az1-97 in workspace <https://jenkins01.openstack.org/job/periodic-tempest-devstack-vm-stable-fol…>
Waiting for the completion of devstack-update-inprogress
devstack-update-inprogress #91 completed. Result was SUCCESS
Build step 'Trigger/call builds on other projects' changed build result to SUCCESS
[periodic-tempest-devstack-vm-stable-folsom] $ /bin/bash -xe /tmp/hudson7883824428032424758.sh
+ [[ ! -e devstack-gate ]]
+ git clone https://review.openstack.org/p/openstack-infra/devstack-gate
Cloning into 'devstack-gate'...
[periodic-tempest-devstack-vm-stable-folsom] $ /bin/bash -xe /tmp/hudson1210421741154908982.sh
+ export PYTHONUNBUFFERED=true
+ PYTHONUNBUFFERED=true
+ export DEVSTACK_GATE_TEMPEST=1
+ DEVSTACK_GATE_TEMPEST=1
+ export ZUUL_BRANCH=stable/folsom
+ ZUUL_BRANCH=stable/folsom
+ cp devstack-gate/devstack-vm-gate-wrap.sh ./safe-devstack-vm-gate-wrap.sh
+ ./safe-devstack-vm-gate-wrap.sh
Build step 'Execute shell' marked build as failure
[SCP] Connecting to static.openstack.org
[SCP] Trying to create /srv/static/logs/periodic/periodic-tempest-devstack-vm-stable-folsom/devstack-precise-hpcloud-az1-97
[SCP] Trying to create /srv/static/logs/periodic/periodic-tempest-devstack-vm-stable-folsom/devstack-precise-hpcloud-az1-97/1
[SCP] Trying to create /srv/static/logs/periodic/periodic-tempest-devstack-vm-stable-folsom/devstack-precise-hpcloud-az1-97/1/logs
[SCP] uploading file: '/srv/static/logs/periodic/periodic-tempest-devstack-vm-stable-folsom/devstack-precise-hpcloud-az1-97/1/logs/devstack-gate-setup-workspace-new.txt'
[SCP] No file(s) found: **/testr_results.html.gz
[SCP] '**/testr_results.html.gz' doesn't match anything: '**' exists but not '**/testr_results.html.gz'
[SCP] No file(s) found: **/subunit_log.txt.gz
[SCP] '**/subunit_log.txt.gz' doesn't match anything: '**' exists but not '**/subunit_log.txt.gz'
[SCP] Connecting to static.openstack.org
[SCP] Copying console log.
2
3
Build failed in Jenkins: periodic-ceilometer-python26-stable-grizzly #1
by OpenStack Jenkins 07 Aug '13
by OpenStack Jenkins 07 Aug '13
07 Aug '13
See <https://jenkins02.openstack.org/job/periodic-ceilometer-python26-stable-gri…>
------------------------------------------
[...truncated 6130 lines...]
invoke_kwds,
File "<https://jenkins02.openstack.org/job/periodic-ceilometer-python26-stable-gri…",> line 52, in _load_one_plugin
ep, invoke_on_load, invoke_args, invoke_kwds,
File "<https://jenkins02.openstack.org/job/periodic-ceilometer-python26-stable-gri…",> line 101, in _load_one_plugin
plugin = ep.load()
File "<https://jenkins02.openstack.org/job/periodic-ceilometer-python26-stable-gri…",> line 2259, in load
if require: self.require(env, installer)
File "<https://jenkins02.openstack.org/job/periodic-ceilometer-python26-stable-gri…",> line 2272, in require
working_set.resolve(self.dist.requires(self.extras),env,installer)))
File "<https://jenkins02.openstack.org/job/periodic-ceilometer-python26-stable-gri…",> line 630, in resolve
raise VersionConflict(dist,req) # XXX put more info here
VersionConflict: (requests 1.2.3 (<https://jenkins02.openstack.org/job/periodic-ceilometer-python26-stable-gri…)> Requirement.parse('requests>=1.1,<1.2.3'))
stevedore.extension: DEBUG: found extension EntryPoint.parse('image = ceilometer.image.glance:ImagePollster')
stevedore.extension: ERROR: Could not load 'image': (requests 1.2.3 (<https://jenkins02.openstack.org/job/periodic-ceilometer-python26-stable-gri…)> Requirement.parse('requests>=1.1,<1.2.3'))
stevedore.extension: ERROR: (requests 1.2.3 (<https://jenkins02.openstack.org/job/periodic-ceilometer-python26-stable-gri…)> Requirement.parse('requests>=1.1,<1.2.3'))
Traceback (most recent call last):
File "<https://jenkins02.openstack.org/job/periodic-ceilometer-python26-stable-gri…",> line 89, in _load_plugins
invoke_kwds,
File "<https://jenkins02.openstack.org/job/periodic-ceilometer-python26-stable-gri…",> line 52, in _load_one_plugin
ep, invoke_on_load, invoke_args, invoke_kwds,
File "<https://jenkins02.openstack.org/job/periodic-ceilometer-python26-stable-gri…",> line 101, in _load_one_plugin
plugin = ep.load()
File "<https://jenkins02.openstack.org/job/periodic-ceilometer-python26-stable-gri…",> line 2259, in load
if require: self.require(env, installer)
File "<https://jenkins02.openstack.org/job/periodic-ceilometer-python26-stable-gri…",> line 2272, in require
working_set.resolve(self.dist.requires(self.extras),env,installer)))
File "<https://jenkins02.openstack.org/job/periodic-ceilometer-python26-stable-gri…",> line 630, in resolve
raise VersionConflict(dist,req) # XXX put more info here
VersionConflict: (requests 1.2.3 (<https://jenkins02.openstack.org/job/periodic-ceilometer-python26-stable-gri…)> Requirement.parse('requests>=1.1,<1.2.3'))
stevedore.extension: DEBUG: found extension EntryPoint.parse('kwapi = ceilometer.energy.kwapi:KwapiPollster')
stevedore.extension: ERROR: Could not load 'kwapi': (requests 1.2.3 (<https://jenkins02.openstack.org/job/periodic-ceilometer-python26-stable-gri…)> Requirement.parse('requests>=1.1,<1.2.3'))
stevedore.extension: ERROR: (requests 1.2.3 (<https://jenkins02.openstack.org/job/periodic-ceilometer-python26-stable-gri…)> Requirement.parse('requests>=1.1,<1.2.3'))
Traceback (most recent call last):
File "<https://jenkins02.openstack.org/job/periodic-ceilometer-python26-stable-gri…",> line 89, in _load_plugins
invoke_kwds,
File "<https://jenkins02.openstack.org/job/periodic-ceilometer-python26-stable-gri…",> line 52, in _load_one_plugin
ep, invoke_on_load, invoke_args, invoke_kwds,
File "<https://jenkins02.openstack.org/job/periodic-ceilometer-python26-stable-gri…",> line 101, in _load_one_plugin
plugin = ep.load()
File "<https://jenkins02.openstack.org/job/periodic-ceilometer-python26-stable-gri…",> line 2259, in load
if require: self.require(env, installer)
File "<https://jenkins02.openstack.org/job/periodic-ceilometer-python26-stable-gri…",> line 2272, in require
working_set.resolve(self.dist.requires(self.extras),env,installer)))
File "<https://jenkins02.openstack.org/job/periodic-ceilometer-python26-stable-gri…",> line 630, in resolve
raise VersionConflict(dist,req) # XXX put more info here
VersionConflict: (requests 1.2.3 (<https://jenkins02.openstack.org/job/periodic-ceilometer-python26-stable-gri…)> Requirement.parse('requests>=1.1,<1.2.3'))
stevedore.extension: DEBUG: found extension EntryPoint.parse('meter_publisher = ceilometer.publisher.meter_publish:MeterPublisher')
stevedore.extension: ERROR: Could not load 'meter_publisher': (requests 1.2.3 (<https://jenkins02.openstack.org/job/periodic-ceilometer-python26-stable-gri…)> Requirement.parse('requests>=1.1,<1.2.3'))
stevedore.extension: ERROR: (requests 1.2.3 (<https://jenkins02.openstack.org/job/periodic-ceilometer-python26-stable-gri…)> Requirement.parse('requests>=1.1,<1.2.3'))
Traceback (most recent call last):
File "<https://jenkins02.openstack.org/job/periodic-ceilometer-python26-stable-gri…",> line 89, in _load_plugins
invoke_kwds,
File "<https://jenkins02.openstack.org/job/periodic-ceilometer-python26-stable-gri…",> line 52, in _load_one_plugin
ep, invoke_on_load, invoke_args, invoke_kwds,
File "<https://jenkins02.openstack.org/job/periodic-ceilometer-python26-stable-gri…",> line 101, in _load_one_plugin
plugin = ep.load()
File "<https://jenkins02.openstack.org/job/periodic-ceilometer-python26-stable-gri…",> line 2259, in load
if require: self.require(env, installer)
File "<https://jenkins02.openstack.org/job/periodic-ceilometer-python26-stable-gri…",> line 2272, in require
working_set.resolve(self.dist.requires(self.extras),env,installer)))
File "<https://jenkins02.openstack.org/job/periodic-ceilometer-python26-stable-gri…",> line 630, in resolve
raise VersionConflict(dist,req) # XXX put more info here
VersionConflict: (requests 1.2.3 (<https://jenkins02.openstack.org/job/periodic-ceilometer-python26-stable-gri…)> Requirement.parse('requests>=1.1,<1.2.3'))
--------------------- >> end captured logging << ---------------------
======================================================================
FAIL: test_v1 (tests.test_bin.BinApiTestCase)
----------------------------------------------------------------------
Traceback (most recent call last):
File "<https://jenkins02.openstack.org/job/periodic-ceilometer-python26-stable-gri…",> line 106, in test_v1
response, content = self.get_response('v1/meters')
File "<https://jenkins02.openstack.org/job/periodic-ceilometer-python26-stable-gri…",> line 101, in get_response
self.assertEqual(self.subp.poll(), None)
AssertionError: 1 != None
>> raise self.failureException, \
(None or '%r != %r' % (1, None))
======================================================================
FAIL: test_v2 (tests.test_bin.BinApiTestCase)
----------------------------------------------------------------------
Traceback (most recent call last):
File "<https://jenkins02.openstack.org/job/periodic-ceilometer-python26-stable-gri…",> line 111, in test_v2
response, content = self.get_response('v2/meters')
File "<https://jenkins02.openstack.org/job/periodic-ceilometer-python26-stable-gri…",> line 101, in get_response
self.assertEqual(self.subp.poll(), None)
AssertionError: 1 != None
>> raise self.failureException, \
(None or '%r != %r' % (1, None))
======================================================================
FAIL: test_dbsync_run (tests.test_bin.BinDbsyncTestCase)
----------------------------------------------------------------------
Traceback (most recent call last):
File "<https://jenkins02.openstack.org/job/periodic-ceilometer-python26-stable-gri…",> line 41, in test_dbsync_run
self.assertEqual(subp.wait(), 0)
AssertionError: 1 != 0
>> raise self.failureException, \
(None or '%r != %r' % (1, 0))
======================================================================
FAIL: test_send_counter_run (tests.test_bin.BinSendCounterTestCase)
----------------------------------------------------------------------
Traceback (most recent call last):
File "<https://jenkins02.openstack.org/job/periodic-ceilometer-python26-stable-gri…",> line 62, in test_send_counter_run
self.assertEqual(subp.wait(), 0)
AssertionError: 1 != 0
>> raise self.failureException, \
(None or '%r != %r' % (1, 0))
----------------------------------------------------------------------
XML: nosetests.xml
----------------------------------------------------------------------
Ran 397 tests in 13.530s
FAILED (SKIP=66, errors=30, failures=5)
ERROR: InvocationError: '<https://jenkins02.openstack.org/job/periodic-ceilometer-python26-stable-gri…> --no-path-adjustment'
___________________________________ summary ____________________________________
ERROR: py26: commands failed
+ result=1
+ echo 'Begin pip freeze output from test virtualenv:'
Begin pip freeze output from test virtualenv:
+ echo ======================================================================
======================================================================
+ .tox/py26/bin/pip freeze
Babel==1.3
Cheetah==2.4.4
Flask==0.9
Jinja2==2.7
Mako==0.8.1
Markdown==2.3.1
MarkupSafe==0.18
Paste==1.7.5.1
PasteDeploy==1.5.0
PyYAML==3.10
Pygments==1.6
Routes==1.13
SQLAlchemy==0.7.10
Sphinx==1.1.3
Tempita==0.5.1
WSME==0.5b2
WebOb==1.2.3
WebTest==2.0.6
Werkzeug==0.9.3
amqp==1.0.13
amqplib==1.0.2
anyjson==0.3.3
argparse==1.2.1
beautifulsoup4==4.2.1
boto==2.9.9
ceilometer==jenkins.periodic.ceilometer.python26.stable.grizzly.1
cffi==0.7.2
cliff==1.4
cmd2==0.6.6
coverage==3.6
d2to1==0.2.10
decorator==3.4.0
dnspython==1.11.0
docutils==0.9.1
eventlet==0.13.0
extras==0.0.3
glance==2013.1
greenlet==0.4.1
happybase==0.6
httplib2==0.8
importlib==1.0.2
iso8601==0.1.4
jsonpatch==1.1
jsonpointer==1.0
jsonschema==2.0.0
kombu==2.5.12
logutils==0.3.3
lxml==3.2.3
mock==1.0.1
mox==0.5.3
netaddr==0.7.10
netifaces==0.8
nose==1.3.0
nova==2013.1
numpy==1.7.1
ordereddict==1.1
oslo.config==1.1.1
paramiko==1.11.0
passlib==1.6.1
pbr==0.5.21
pecan==0.3.1
prettytable==0.7.2
pyOpenSSL==0.13
pyasn1==0.1.7
pycparser==2.10
pycrypto==2.6
pymongo==2.5.2
pyparsing==1.5.7
python-cinderclient==1.0.5
python-glanceclient==0.9.0
python-keystoneclient==0.3.1
python-novaclient==2.14.0
python-quantumclient==2.2.3
python-spidermonkey==0.0.10
python-swiftclient==1.5.0
pytz==2013b
repoze.lru==0.6
requests==1.2.3
setuptools-git==1.0
simplegeneric==0.8.1
simplejson==3.3.0
six==1.3.0
sqlalchemy-migrate==0.7.2
stevedore==0.10
suds==0.4
swift==1.9.0
thrift==0.9.0
unittest2==0.5.1
waitress==0.8.5
warlock==1.0.1
websockify==0.3.0
wsgiref==0.1.2
xattr==0.7.2
+ echo ======================================================================
======================================================================
+ '[' -d .testrepository ']'
+ sudo /usr/local/jenkins/slave_scripts/jenkins-sudo-grep.sh post
+ sudoresult=0
+ '[' 0 -ne 0 ']'
+ /usr/local/jenkins/slave_scripts/jenkins-oom-grep.sh post
+ oomresult=0
+ '[' 0 -ne 0 ']'
++ find . -name nose_results.html
+ htmlreport=
+ '[' -f '' ']'
+ echo
+ echo 'WARNING: Unable to find to confirm results!'
WARNING: Unable to find to confirm results!
+ echo
+ exit 1
+ rm -rf /tmp/tmp.504DsUtBdq
Build step 'Execute shell' marked build as failure
[SCP] Connecting to static.openstack.org
[SCP] No file(s) found: **/*nose_results.html
[SCP] '**/*nose_results.html' doesn't match anything: '**' exists but not '**/*nose_results.html'
[SCP] Connecting to static.openstack.org
[SCP] Trying to create /srv/static/logs/periodic/periodic-ceilometer-python26-stable-grizzly/centos6-10
[SCP] Trying to create /srv/static/logs/periodic/periodic-ceilometer-python26-stable-grizzly/centos6-10/1
[SCP] Copying console log.
1
1
07 Aug '13
See <https://jenkins01.openstack.org/job/periodic-ceilometer-docs-stable-grizzly…>
------------------------------------------
[...truncated 361 lines...]
__import__(self.modname)
File "<https://jenkins01.openstack.org/job/periodic-ceilometer-docs-stable-grizzly…",> line 24, in <module>
import nova.conductor
File "<https://jenkins01.openstack.org/job/periodic-ceilometer-docs-stable-grizzly…",> line 17, in <module>
from nova.conductor import api as conductor_api
File "<https://jenkins01.openstack.org/job/periodic-ceilometer-docs-stable-grizzly…",> line 19, in <module>
from nova.conductor import manager
File "<https://jenkins01.openstack.org/job/periodic-ceilometer-docs-stable-grizzly…",> line 17, in <module>
from nova.api.ec2 import ec2utils
File "<https://jenkins01.openstack.org/job/periodic-ceilometer-docs-stable-grizzly…",> line 31, in <module>
from nova.api.ec2 import apirequest
File "<https://jenkins01.openstack.org/job/periodic-ceilometer-docs-stable-grizzly…",> line 27, in <module>
from nova.api.ec2 import ec2utils
File "<https://jenkins01.openstack.org/job/periodic-ceilometer-docs-stable-grizzly…",> line 22, in <module>
from nova import availability_zones
File "<https://jenkins01.openstack.org/job/periodic-ceilometer-docs-stable-grizzly…",> line 20, in <module>
from nova import db
File "<https://jenkins01.openstack.org/job/periodic-ceilometer-docs-stable-grizzly…",> line 23, in <module>
from nova.db.api import *
File "<https://jenkins01.openstack.org/job/periodic-ceilometer-docs-stable-grizzly…",> line 48, in <module>
from nova.cells import rpcapi as cells_rpcapi
File "<https://jenkins01.openstack.org/job/periodic-ceilometer-docs-stable-grizzly…",> line 30, in <module>
from nova.openstack.common.rpc import proxy as rpc_proxy
File "<https://jenkins01.openstack.org/job/periodic-ceilometer-docs-stable-grizzly…",> line 75, in <module>
CONF.register_opts(rpc_opts)
File "<https://jenkins01.openstack.org/job/periodic-ceilometer-docs-stable-grizzly…",> line 1125, in __inner
return f(self, *args, **kwargs)
File "<https://jenkins01.openstack.org/job/periodic-ceilometer-docs-stable-grizzly…",> line 1255, in register_opts
self.register_opt(opt, group, clear_cache=False)
File "<https://jenkins01.openstack.org/job/periodic-ceilometer-docs-stable-grizzly…",> line 1125, in __inner
return f(self, *args, **kwargs)
File "<https://jenkins01.openstack.org/job/periodic-ceilometer-docs-stable-grizzly…",> line 1244, in register_opt
if _is_opt_registered(self._opts, opt):
File "<https://jenkins01.openstack.org/job/periodic-ceilometer-docs-stable-grizzly…",> line 479, in _is_opt_registered
raise DuplicateOptError(opt.name)
DuplicateOptError: duplicate option: rpc_backend
reading sources... [ 18%] api/ceilometer.compute.plugin
reading sources... [ 19%] api/ceilometer.compute.pollsters
reading sources... [ 20%] api/ceilometer.compute.virt.inspector
reading sources... [ 20%] api/ceilometer.compute.virt.libvirt.inspector
reading sources... [ 21%] api/ceilometer.counter
reading sources... [ 22%] api/ceilometer.energy.kwapi
reading sources... [ 23%] api/ceilometer.extension_manager
reading sources... [ 24%] api/ceilometer.image.glance
reading sources... [ 25%] api/ceilometer.image.notifications
reading sources... [ 25%] api/ceilometer.network.floatingip
reading sources... [ 26%] api/ceilometer.network.notifications
reading sources... [ 27%] api/ceilometer.nova_client
reading sources... [ 28%] api/ceilometer.objectstore.swift
reading sources... [ 29%] api/ceilometer.objectstore.swift_middleware
reading sources... [ 30%] api/ceilometer.openstack.common.context
reading sources... [ 30%] api/ceilometer.openstack.common.eventlet_backdoor
reading sources... [ 31%] api/ceilometer.openstack.common.excutils
reading sources... [ 32%] api/ceilometer.openstack.common.gettextutils
reading sources... [ 33%] api/ceilometer.openstack.common.importutils
reading sources... [ 34%] api/ceilometer.openstack.common.jsonutils
reading sources... [ 35%] api/ceilometer.openstack.common.local
reading sources... [ 35%] api/ceilometer.openstack.common.log
reading sources... [ 36%] api/ceilometer.openstack.common.loopingcall
reading sources... [ 37%] api/ceilometer.openstack.common.network_utils
reading sources... [ 38%] api/ceilometer.openstack.common.notifier.api
reading sources... [ 39%] api/ceilometer.openstack.common.notifier.list_notifier
reading sources... [ 40%] api/ceilometer.openstack.common.notifier.log_notifier
reading sources... [ 40%] api/ceilometer.openstack.common.notifier.no_op_notifier
reading sources... [ 41%] api/ceilometer.openstack.common.notifier.rabbit_notifier
reading sources... [ 42%] api/ceilometer.openstack.common.notifier.rpc_notifier
reading sources... [ 43%] api/ceilometer.openstack.common.notifier.rpc_notifier2
reading sources... [ 44%] api/ceilometer.openstack.common.notifier.test_notifier
reading sources... [ 45%] api/ceilometer.openstack.common.policy
reading sources... [ 45%] api/ceilometer.openstack.common.rpc.amqp
reading sources... [ 46%] api/ceilometer.openstack.common.rpc.common
reading sources... [ 47%] api/ceilometer.openstack.common.rpc.dispatcher
reading sources... [ 48%] api/ceilometer.openstack.common.rpc.impl_fake
reading sources... [ 49%] api/ceilometer.openstack.common.rpc.impl_kombu
reading sources... [ 50%] api/ceilometer.openstack.common.rpc.impl_qpid
reading sources... [ 50%] api/ceilometer.openstack.common.rpc.impl_zmq
Traceback (most recent call last):
File "<https://jenkins01.openstack.org/job/periodic-ceilometer-docs-stable-grizzly…",> line 321, in import_object
__import__(self.modname)
File "<https://jenkins01.openstack.org/job/periodic-ceilometer-docs-stable-grizzly…",> line 33, in <module>
from ceilometer.openstack.common import processutils as utils
ImportError: cannot import name processutils
reading sources... [ 51%] api/ceilometer.openstack.common.rpc.matchmaker
reading sources... [ 52%] api/ceilometer.openstack.common.rpc.matchmaker_redis
reading sources... [ 53%] api/ceilometer.openstack.common.rpc.proxy
reading sources... [ 54%] api/ceilometer.openstack.common.rpc.service
reading sources... [ 55%] api/ceilometer.openstack.common.service
reading sources... [ 55%] api/ceilometer.openstack.common.setup
reading sources... [ 56%] api/ceilometer.openstack.common.threadgroup
reading sources... [ 57%] api/ceilometer.openstack.common.timeutils
reading sources... [ 58%] api/ceilometer.openstack.common.version
reading sources... [ 59%] api/ceilometer.pipeline
reading sources... [ 60%] api/ceilometer.plugin
reading sources... [ 60%] api/ceilometer.policy
reading sources... [ 61%] api/ceilometer.publisher.meter_publish
reading sources... [ 62%] api/ceilometer.service
reading sources... [ 63%] api/ceilometer.storage.base
reading sources... [ 64%] api/ceilometer.storage.impl_hbase
reading sources... [ 65%] api/ceilometer.storage.impl_log
reading sources... [ 65%] api/ceilometer.storage.impl_mongodb
reading sources... [ 66%] api/ceilometer.storage.impl_sqlalchemy
reading sources... [ 67%] api/ceilometer.storage.impl_test
reading sources... [ 68%] api/ceilometer.storage.sqlalchemy.migrate_repo.manage
reading sources... [ 69%] api/ceilometer.storage.sqlalchemy.migrate_repo.versions.001_add_meter_table
reading sources... [ 70%] api/ceilometer.storage.sqlalchemy.migrate_repo.versions.002_remove_duration
reading sources... [ 70%] api/ceilometer.storage.sqlalchemy.migrate_repo.versions.003_set_utf8_charset
reading sources... [ 71%] api/ceilometer.storage.sqlalchemy.migrate_repo.versions.004_add_counter_unit
reading sources... [ 72%] api/ceilometer.storage.sqlalchemy.migrate_repo.versions.005_remove_resource_timestamp
reading sources... [ 73%] api/ceilometer.storage.sqlalchemy.migrate_repo.versions.006_counter_volume_is_float
reading sources... [ 74%] api/ceilometer.storage.sqlalchemy.migration
reading sources... [ 75%] api/ceilometer.storage.sqlalchemy.models
reading sources... [ 75%] api/ceilometer.storage.sqlalchemy.session
reading sources... [ 76%] api/ceilometer.tests.api
Traceback (most recent call last):
File "<https://jenkins01.openstack.org/job/periodic-ceilometer-docs-stable-grizzly…",> line 321, in import_object
__import__(self.modname)
File "<https://jenkins01.openstack.org/job/periodic-ceilometer-docs-stable-grizzly…",> line 31, in <module>
from ceilometer.api.v1 import app as v1_app
File "<https://jenkins01.openstack.org/job/periodic-ceilometer-docs-stable-grizzly…",> line 29, in <module>
storage.register_opts(cfg.CONF)
File "<https://jenkins01.openstack.org/job/periodic-ceilometer-docs-stable-grizzly…",> line 49, in register_opts
p = get_engine(conf)
File "<https://jenkins01.openstack.org/job/periodic-ceilometer-docs-stable-grizzly…",> line 60, in get_engine
invoke_on_load=True)
File "<https://jenkins01.openstack.org/job/periodic-ceilometer-docs-stable-grizzly…",> line 35, in __init__
(namespace, name))
RuntimeError: No 'ceilometer.storage' driver found, looking for 'mongodb'
reading sources... [ 77%] api/ceilometer.tests.base
reading sources... [ 78%] api/ceilometer.tests.db
reading sources... [ 79%] api/ceilometer.tests.skip
reading sources... [ 80%] api/ceilometer.transformer.accumulator
reading sources... [ 80%] api/ceilometer.utils
reading sources... [ 81%] api/ceilometer.volume.notifications
reading sources... [ 82%] api/index
reading sources... [ 83%] architecture
reading sources... [ 84%] configuration
reading sources... [ 85%] contributing/areas
reading sources... [ 85%] contributing/index
reading sources... [ 86%] contributing/plugins
reading sources... [ 87%] contributing/resources
reading sources... [ 88%] contributing/source
reading sources... [ 89%] contributing/user
reading sources... [ 90%] glossary
reading sources... [ 90%] index
reading sources... [ 91%] install/development
reading sources... [ 92%] install/index
reading sources... [ 93%] install/manual
reading sources... [ 94%] install/mod_wsgi
reading sources... [ 95%] measurements
reading sources... [ 95%] releasenotes/folsom
reading sources... [ 96%] releasenotes/index
reading sources... [ 97%] sourcecode/autoindex
reading sources... [ 98%] webapi/index
reading sources... [ 99%] webapi/v1
Traceback (most recent call last):
File "setup.py", line 148, in <module>
"""),
File "/usr/lib/python2.7/distutils/core.py", line 152, in setup
dist.run_commands()
File "/usr/lib/python2.7/distutils/dist.py", line 953, in run_commands
self.run_command(cmd)
File "/usr/lib/python2.7/distutils/dist.py", line 972, in run_command
cmd_obj.run()
File "<https://jenkins01.openstack.org/job/periodic-ceilometer-docs-stable-grizzly…",> line 267, in run
BuildDoc.run(self)
File "<https://jenkins01.openstack.org/job/periodic-ceilometer-docs-stable-grizzly…",> line 143, in run
app.build(force_all=self.all_files)
File "<https://jenkins01.openstack.org/job/periodic-ceilometer-docs-stable-grizzly…",> line 200, in build
self.builder.build_all()
File "<https://jenkins01.openstack.org/job/periodic-ceilometer-docs-stable-grizzly…",> line 159, in build_all
self.build(None, summary='all source files', method='all')
File "<https://jenkins01.openstack.org/job/periodic-ceilometer-docs-stable-grizzly…",> line 216, in build
purple, length):
File "<https://jenkins01.openstack.org/job/periodic-ceilometer-docs-stable-grizzly…",> line 120, in status_iterator
for item in iterable:
File "<https://jenkins01.openstack.org/job/periodic-ceilometer-docs-stable-grizzly…",> line 613, in update_generator
self.read_doc(docname, app=app)
File "<https://jenkins01.openstack.org/job/periodic-ceilometer-docs-stable-grizzly…",> line 761, in read_doc
pub.publish()
File "<https://jenkins01.openstack.org/job/periodic-ceilometer-docs-stable-grizzly…",> line 221, in publish
self.settings)
File "<https://jenkins01.openstack.org/job/periodic-ceilometer-docs-stable-grizzly…",> line 69, in read
self.parse()
File "<https://jenkins01.openstack.org/job/periodic-ceilometer-docs-stable-grizzly…",> line 75, in parse
self.parser.parse(self.input, document)
File "<https://jenkins01.openstack.org/job/periodic-ceilometer-docs-stable-grizzly…",> line 162, in parse
self.statemachine.run(inputlines, document, inliner=self.inliner)
File "<https://jenkins01.openstack.org/job/periodic-ceilometer-docs-stable-grizzly…",> line 174, in run
input_source=document['source'])
File "<https://jenkins01.openstack.org/job/periodic-ceilometer-docs-stable-grizzly…",> line 239, in run
context, state, transitions)
File "<https://jenkins01.openstack.org/job/periodic-ceilometer-docs-stable-grizzly…",> line 460, in check_line
return method(match, context, next_state)
File "<https://jenkins01.openstack.org/job/periodic-ceilometer-docs-stable-grizzly…",> line 2938, in text
self.section(title.lstrip(), source, style, lineno + 1, messages)
File "<https://jenkins01.openstack.org/job/periodic-ceilometer-docs-stable-grizzly…",> line 331, in section
self.new_subsection(title, lineno, messages)
File "<https://jenkins01.openstack.org/job/periodic-ceilometer-docs-stable-grizzly…",> line 399, in new_subsection
node=section_node, match_titles=True)
File "<https://jenkins01.openstack.org/job/periodic-ceilometer-docs-stable-grizzly…",> line 286, in nested_parse
node=node, match_titles=match_titles)
File "<https://jenkins01.openstack.org/job/periodic-ceilometer-docs-stable-grizzly…",> line 199, in run
results = StateMachineWS.run(self, input_lines, input_offset)
File "<https://jenkins01.openstack.org/job/periodic-ceilometer-docs-stable-grizzly…",> line 239, in run
context, state, transitions)
File "<https://jenkins01.openstack.org/job/periodic-ceilometer-docs-stable-grizzly…",> line 460, in check_line
return method(match, context, next_state)
File "<https://jenkins01.openstack.org/job/periodic-ceilometer-docs-stable-grizzly…",> line 2281, in explicit_markup
self.explicit_list(blank_finish)
File "<https://jenkins01.openstack.org/job/periodic-ceilometer-docs-stable-grizzly…",> line 2311, in explicit_list
match_titles=self.state_machine.match_titles)
File "<https://jenkins01.openstack.org/job/periodic-ceilometer-docs-stable-grizzly…",> line 323, in nested_list_parse
node=node, match_titles=match_titles)
File "<https://jenkins01.openstack.org/job/periodic-ceilometer-docs-stable-grizzly…",> line 199, in run
results = StateMachineWS.run(self, input_lines, input_offset)
File "<https://jenkins01.openstack.org/job/periodic-ceilometer-docs-stable-grizzly…",> line 239, in run
context, state, transitions)
File "<https://jenkins01.openstack.org/job/periodic-ceilometer-docs-stable-grizzly…",> line 460, in check_line
return method(match, context, next_state)
File "<https://jenkins01.openstack.org/job/periodic-ceilometer-docs-stable-grizzly…",> line 2584, in explicit_markup
nodelist, blank_finish = self.explicit_construct(match)
File "<https://jenkins01.openstack.org/job/periodic-ceilometer-docs-stable-grizzly…",> line 2291, in explicit_construct
return method(self, expmatch)
File "<https://jenkins01.openstack.org/job/periodic-ceilometer-docs-stable-grizzly…",> line 2034, in directive
directive_class, match, type_name, option_presets)
File "<https://jenkins01.openstack.org/job/periodic-ceilometer-docs-stable-grizzly…",> line 2083, in run_directive
result = directive_instance.run()
File "<https://jenkins01.openstack.org/job/periodic-ceilometer-docs-stable-grizzly…",> line 152, in run
for line in self.make_rst():
File "<https://jenkins01.openstack.org/job/periodic-ceilometer-docs-stable-grizzly…",> line 113, in make_rst
app = import_object(self.arguments[0])
File "<https://jenkins01.openstack.org/job/periodic-ceilometer-docs-stable-grizzly…",> line 33, in import_object
mod = __import__(module_name)
File "<https://jenkins01.openstack.org/job/periodic-ceilometer-docs-stable-grizzly…",> line 29, in <module>
storage.register_opts(cfg.CONF)
File "<https://jenkins01.openstack.org/job/periodic-ceilometer-docs-stable-grizzly…",> line 49, in register_opts
p = get_engine(conf)
File "<https://jenkins01.openstack.org/job/periodic-ceilometer-docs-stable-grizzly…",> line 60, in get_engine
invoke_on_load=True)
File "<https://jenkins01.openstack.org/job/periodic-ceilometer-docs-stable-grizzly…",> line 35, in __init__
(namespace, name))
RuntimeError: No 'ceilometer.storage' driver found, looking for 'mongodb'
ERROR: InvocationError: '<https://jenkins01.openstack.org/job/periodic-ceilometer-docs-stable-grizzly…> setup.py build_sphinx'
___________________________________ summary ____________________________________
ERROR: venv: commands failed
Build step 'Execute shell' marked build as failure
[SCP] Connecting to static.openstack.org
[SCP] Trying to create /srv/static/logs/periodic/periodic-ceilometer-docs-stable-grizzly/precise1/1
[SCP] Copying console log.
1
1
Build failed in Jenkins: periodic-tempest-devstack-vm-postgres-stable-grizzly #126
by OpenStack Jenkins 05 Aug '13
by OpenStack Jenkins 05 Aug '13
05 Aug '13
See <https://jenkins.openstack.org/job/periodic-tempest-devstack-vm-postgres-sta…>
------------------------------------------
Started by user anonymous
[EnvInject] - Loading node environment variables.
Building remotely on devstack-precise-hpcloud-az1-182672 in workspace <https://jenkins.openstack.org/job/periodic-tempest-devstack-vm-postgres-sta…>
Waiting for the completion of devstack-update-inprogress
devstack-update-inprogress #213150 completed. Result was SUCCESS
Build step 'Trigger/call builds on other projects' changed build result to SUCCESS
[periodic-tempest-devstack-vm-postgres-stable-grizzly] $ /bin/bash -xe /tmp/hudson2805010110927881903.sh
+ [[ ! -e devstack-gate ]]
+ git clone https://review.openstack.org/p/openstack-infra/devstack-gate
Cloning into 'devstack-gate'...
[periodic-tempest-devstack-vm-postgres-stable-grizzly] $ /bin/bash -xe /tmp/hudson4125166887861330807.sh
+ export PYTHONUNBUFFERED=true
+ PYTHONUNBUFFERED=true
+ export DEVSTACK_GATE_TEMPEST=1
+ DEVSTACK_GATE_TEMPEST=1
+ export DEVSTACK_GATE_POSTGRES=1
+ DEVSTACK_GATE_POSTGRES=1
+ export DEVSTACK_GATE_TEMPEST_FULL=1
+ DEVSTACK_GATE_TEMPEST_FULL=1
+ cp devstack-gate/devstack-vm-gate-wrap.sh ./safe-devstack-vm-gate-wrap.sh
+ ./safe-devstack-vm-gate-wrap.sh
Build step 'Execute shell' marked build as failure
[SCP] Connecting to static.openstack.org
[SCP] Trying to create /srv/static/logs/periodic/periodic-tempest-devstack-vm-postgres-stable-grizzly/devstack-precise-hpcloud-az1-182672
[SCP] Trying to create /srv/static/logs/periodic/periodic-tempest-devstack-vm-postgres-stable-grizzly/devstack-precise-hpcloud-az1-182672/126
[SCP] Trying to create /srv/static/logs/periodic/periodic-tempest-devstack-vm-postgres-stable-grizzly/devstack-precise-hpcloud-az1-182672/126/logs
[SCP] uploading file: '/srv/static/logs/periodic/periodic-tempest-devstack-vm-postgres-stable-grizzly/devstack-precise-hpcloud-az1-182672/126/logs/devstack-gate-setup-workspace-new.txt'
[SCP] No file(s) found: **/testr_results.html.gz
[SCP] '**/testr_results.html.gz' doesn't match anything: '**' exists but not '**/testr_results.html.gz'
[SCP] No file(s) found: **/subunit_log.txt.gz
[SCP] '**/subunit_log.txt.gz' doesn't match anything: '**' exists but not '**/subunit_log.txt.gz'
[SCP] Connecting to static.openstack.org
[SCP] Copying console log.
1
1
05 Aug '13
See <https://jenkins.openstack.org/job/periodic-heat-python27-stable-grizzly/121…>
Changes:
[shardy] Only call FnGetAtt if resource is in acceptable state.
[shardy] Define behaviour for properties with None values.
[shardy] Fix SecurityGroups for AWS::AutoScaling::LaunchConfiguration
------------------------------------------
[...truncated 643 lines...]
test_describe_stack_resources (heat.tests.test_rpc_client.EngineRpcAPITestCase) ... ok
test_find_physical_resource (heat.tests.test_rpc_client.EngineRpcAPITestCase) ... ok
test_get_template (heat.tests.test_rpc_client.EngineRpcAPITestCase) ... ok
test_list_events (heat.tests.test_rpc_client.EngineRpcAPITestCase) ... ok
test_list_stack_resources (heat.tests.test_rpc_client.EngineRpcAPITestCase) ... ok
test_metadata_update (heat.tests.test_rpc_client.EngineRpcAPITestCase) ... ok
test_set_watch_state (heat.tests.test_rpc_client.EngineRpcAPITestCase) ... ok
test_show_stack (heat.tests.test_rpc_client.EngineRpcAPITestCase) ... ok
test_show_watch (heat.tests.test_rpc_client.EngineRpcAPITestCase) ... ok
test_show_watch_metric (heat.tests.test_rpc_client.EngineRpcAPITestCase) ... ok
test_update_stack (heat.tests.test_rpc_client.EngineRpcAPITestCase) ... ok
test_validate_template (heat.tests.test_rpc_client.EngineRpcAPITestCase) ... ok
test_attributes (heat.tests.test_s3.s3Test) ... ok
test_authenticated_read (heat.tests.test_s3.s3Test) ... ok
test_create_container_name (heat.tests.test_s3.s3Test) ... ok
test_delete_exception (heat.tests.test_s3.s3Test) ... ok
test_delete_retain (heat.tests.test_s3.s3Test) ... ok
test_public_read (heat.tests.test_s3.s3Test) ... ok
test_public_read_write (heat.tests.test_s3.s3Test) ... ok
test_website (heat.tests.test_s3.s3Test) ... ok
test_security_group_nova (heat.tests.test_security_group.SecurityGroupTest) ... ok
test_security_group_nova_exception (heat.tests.test_security_group.SecurityGroupTest) ... ok
test_byte_string_12 (heat.tests.test_short_id.ShortIdTest) ... ok
test_byte_string_16 (heat.tests.test_short_id.ShortIdTest) ... ok
test_byte_string_60 (heat.tests.test_short_id.ShortIdTest) ... ok
test_byte_string_8 (heat.tests.test_short_id.ShortIdTest) ... ok
test_generate_ids (heat.tests.test_short_id.ShortIdTest) ... ok
test_get_id_string (heat.tests.test_short_id.ShortIdTest) ... ok
test_get_id_uuid1 (heat.tests.test_short_id.ShortIdTest) ... ok
test_get_id_uuid_0 (heat.tests.test_short_id.ShortIdTest) ... ok
test_get_id_uuid_1 (heat.tests.test_short_id.ShortIdTest) ... ok
test_get_id_uuid_endianness (heat.tests.test_short_id.ShortIdTest) ... ok
test_get_id_uuid_f (heat.tests.test_short_id.ShortIdTest) ... ok
test_attributes (heat.tests.test_swift.swiftTest) ... ok
test_build_meta_headers (heat.tests.test_swift.swiftTest) ... ok
test_create_container_name (heat.tests.test_swift.swiftTest) ... ok
test_delete_exception (heat.tests.test_swift.swiftTest) ... ok
test_delete_retain (heat.tests.test_swift.swiftTest) ... ok
test_public_read (heat.tests.test_swift.swiftTest) ... ok
test_public_read_write (heat.tests.test_swift.swiftTest) ... ok
test_website (heat.tests.test_swift.swiftTest) ... ok
test_convert_all_templates (heat.tests.test_template_format.JsonToYamlTest) ... ok
test_quantum_resolved (heat.tests.test_template_format.JsonYamlResolvedCompareTest) ... ok
test_wordpress_resolved (heat.tests.test_template_format.JsonYamlResolvedCompareTest) ... ok
test_minimal_yaml (heat.tests.test_template_format.YamlMinimalTest) ... ok
test_file_scheme (heat.tests.test_urlfetch.UrlFetchTest) ... ok
test_garbage (heat.tests.test_urlfetch.UrlFetchTest) ... ok
test_http_error (heat.tests.test_urlfetch.UrlFetchTest) ... ok
test_http_scheme (heat.tests.test_urlfetch.UrlFetchTest) ... ok
test_https_scheme (heat.tests.test_urlfetch.UrlFetchTest) ... ok
test_access_key (heat.tests.test_user.AccessKeyTest) ... ok
test_access_key_no_user (heat.tests.test_user.AccessKeyTest) ... ok
test_accesspolicy_access_allowed (heat.tests.test_user.AccessPolicyTest) ... ok
test_accesspolicy_create_err_notfound (heat.tests.test_user.AccessPolicyTest) ... ok
test_accesspolicy_create_ok (heat.tests.test_user.AccessPolicyTest) ... ok
test_accesspolicy_create_ok_empty (heat.tests.test_user.AccessPolicyTest) ... ok
test_accesspolicy_update (heat.tests.test_user.AccessPolicyTest) ... ok
test_user (heat.tests.test_user.UserTest) ... ok
test_user_access_allowed (heat.tests.test_user.UserTest) ... ok
test_user_access_allowed_ignorepolicy (heat.tests.test_user.UserTest) ... ok
test_user_create_bad_policies (heat.tests.test_user.UserTest) ... ok
test_user_validate_policies (heat.tests.test_user.UserTest) ... ok
test_validate_findinmap_invalid (heat.tests.test_validate.validateTest) ... ok
test_validate_findinmap_valid (heat.tests.test_validate.validateTest) ... ok
test_validate_ref_invalid (heat.tests.test_validate.validateTest) ... ok
test_validate_ref_valid (heat.tests.test_validate.validateTest) ... ok
test_validate_volumeattach_invalid (heat.tests.test_validate.validateTest) ... ok
test_validate_volumeattach_valid (heat.tests.test_validate.validateTest) ... ok
test_volume (heat.tests.test_volume.VolumeTest) ... ok
test_volume_attachment (heat.tests.test_volume.VolumeTest) ... ok
test_volume_attachment_error (heat.tests.test_volume.VolumeTest) ... ok
test_volume_create_error (heat.tests.test_volume.VolumeTest) ... ok
test_internet_gateway (heat.tests.test_vpc.InternetGatewayTest) ... ok
test_network_interface (heat.tests.test_vpc.NetworkInterfaceTest) ... ok
test_route_table (heat.tests.test_vpc.RouteTableTest) ... ok
test_subnet (heat.tests.test_vpc.SubnetTest) ... ok
test_vpc (heat.tests.test_vpc.VPCTest) ... ok
test_get_status (heat.tests.test_waitcondition.WaitConditionHandleTest) ... ok
test_get_status_reason (heat.tests.test_waitcondition.WaitConditionHandleTest) ... ok
test_handle (heat.tests.test_waitcondition.WaitConditionHandleTest) ... ok
test_metadata_update (heat.tests.test_waitcondition.WaitConditionHandleTest) ... ok
test_metadata_update_invalid (heat.tests.test_waitcondition.WaitConditionHandleTest) ... ok
test_FnGetAtt (heat.tests.test_waitcondition.WaitConditionTest) ... ok
test_post_failure_to_handle (heat.tests.test_waitcondition.WaitConditionTest) ... ok
test_post_failure_to_handle_count (heat.tests.test_waitcondition.WaitConditionTest) ... ok
test_post_success_to_handle (heat.tests.test_waitcondition.WaitConditionTest) ... ok
test_post_success_to_handle_count (heat.tests.test_waitcondition.WaitConditionTest) ... ok
test_timeout (heat.tests.test_waitcondition.WaitConditionTest) ... ok
test_validate_handle_url_bad_resource (heat.tests.test_waitcondition.WaitConditionTest) ... ok
test_validate_handle_url_bad_resource_type (heat.tests.test_waitcondition.WaitConditionTest) ... ok
test_validate_handle_url_bad_stackid (heat.tests.test_waitcondition.WaitConditionTest) ... ok
test_validate_handle_url_bad_stackname (heat.tests.test_waitcondition.WaitConditionTest) ... ok
test_validate_handle_url_bad_tenant (heat.tests.test_waitcondition.WaitConditionTest) ... ok
test_ave (heat.tests.test_watch.WatchRuleTest) ... ok
test_create_watch_data (heat.tests.test_watch.WatchRuleTest) ... ok
test_evaluate (heat.tests.test_watch.WatchRuleTest) ... ok
test_load (heat.tests.test_watch.WatchRuleTest) ... ok
test_maximum (heat.tests.test_watch.WatchRuleTest) ... ok
test_minimum (heat.tests.test_watch.WatchRuleTest) ... ok
test_rule_actions_alarm_alarm (heat.tests.test_watch.WatchRuleTest) ... ok
test_rule_actions_alarm_normal (heat.tests.test_watch.WatchRuleTest) ... ok
test_rule_actions_alarm_two_actions (heat.tests.test_watch.WatchRuleTest) ... ok
test_rule_actions_nodata (heat.tests.test_watch.WatchRuleTest) ... ok
test_rule_actions_ok_alarm (heat.tests.test_watch.WatchRuleTest) ... ok
test_samplecount (heat.tests.test_watch.WatchRuleTest) ... ok
test_set_watch_state (heat.tests.test_watch.WatchRuleTest) ... ok
test_set_watch_state_invalid (heat.tests.test_watch.WatchRuleTest) ... ok
test_store (heat.tests.test_watch.WatchRuleTest) ... ok
test_sum (heat.tests.test_watch.WatchRuleTest) ... ok
======================================================================
FAIL: test_FnGetAtt (heat.tests.test_metadata_refresh.MetadataRefreshTest)
----------------------------------------------------------------------
Traceback (most recent call last):
File "<https://jenkins.openstack.org/job/periodic-heat-python27-stable-grizzly/ws/…",> line 75, in wrapped_test
test_fn(test_cls)
File "<https://jenkins.openstack.org/job/periodic-heat-python27-stable-grizzly/ws/…",> line 176, in test_FnGetAtt
self.assertEqual(s2.CREATE_COMPLETE, s2.state)
AssertionError: 'CREATE_COMPLETE' != 'CREATE_FAILED'
-------------------- >> begin captured stdout << ---------------------
Running test test_FnGetAtt
--------------------- >> end captured stdout << ----------------------
"'CREATE_COMPLETE' != 'CREATE_FAILED'" = '%s != %s' % (safe_repr('CREATE_COMPLETE'), safe_repr('CREATE_FAILED'))
"'CREATE_COMPLETE' != 'CREATE_FAILED'" = self._formatMessage("'CREATE_COMPLETE' != 'CREATE_FAILED'", "'CREATE_COMPLETE' != 'CREATE_FAILED'")
>> raise self.failureException("'CREATE_COMPLETE' != 'CREATE_FAILED'")
-------------------- >> begin captured logging << --------------------
heat.engine.resource: INFO: creating Instance "S1"
heat.engine.resource: INFO: creating Instance "S2"
heat.engine.resource: ERROR: create Instance "S2"
Traceback (most recent call last):
File "<https://jenkins.openstack.org/job/periodic-heat-python27-stable-grizzly/ws/…",> line 320, in create
self.handle_create()
File "<https://jenkins.openstack.org/job/periodic-heat-python27-stable-grizzly/ws/…",> line 765, in __call__
return mock_method(*params, **named_params)
File "<https://jenkins.openstack.org/job/periodic-heat-python27-stable-grizzly/ws/…",> line 1002, in __call__
expected_method = self._VerifyMethodCall()
File "<https://jenkins.openstack.org/job/periodic-heat-python27-stable-grizzly/ws/…",> line 1049, in _VerifyMethodCall
expected = self._PopNextMethod()
File "<https://jenkins.openstack.org/job/periodic-heat-python27-stable-grizzly/ws/…",> line 1035, in _PopNextMethod
raise UnexpectedMethodCallError(self, None)
UnexpectedMethodCallError: Unexpected method call handle_create.__call__() -> None
heat.engine.resource: INFO: deleting Instance "S1" (inst:None db_id:12)
--------------------- >> end captured logging << ---------------------
----------------------------------------------------------------------
XML: nosetests.xml
----------------------------------------------------------------------
Ran 694 tests in 13.223s
FAILED (failures=1)
ERROR: InvocationError: '<https://jenkins.openstack.org/job/periodic-heat-python27-stable-grizzly/ws/…> -a tag=unit'
___________________________________ summary ____________________________________
ERROR: py27: commands failed
+ result=1
+ echo 'Begin pip freeze output from test virtualenv:'
Begin pip freeze output from test virtualenv:
+ echo ======================================================================
======================================================================
+ .tox/py27/bin/pip freeze
Babel==1.3
Jinja2==2.7
MarkupSafe==0.18
PasteDeploy==1.5.0
PyYAML==3.10
Pygments==1.6
Routes==1.12.3
SQLAlchemy==0.7.10
Sphinx==1.1.3
Tempita==0.5.1
WebOb==1.2.3
amqp==1.0.13
anyjson==0.3.3
argparse==1.2.1
boto==2.9.9
cliff==1.4
cmd2==0.6.5.1
colorama==0.2.5
coverage==3.6
d2to1==0.2.10
decorator==3.4.0
distribute==0.7.3
docutils==0.10
eventlet==0.13.0
greenlet==0.4.1
heat==jenkins.periodic.heat.python27.stable.grizzly.121
httplib2==0.8
iso8601==0.1.4
jsonpatch==1.1
jsonpointer==1.0
jsonschema==2.0.0
kombu==2.5.12
lxml==2.3.5
mox==0.5.3
nose==1.3.0
nosexcover==1.0.8
openstack.nose-plugin==0.11
oslo.config==1.1.1
paramiko==1.11.0
pbr==0.5.21
pep8==1.3.4
prettytable==0.7.2
pyOpenSSL==0.13
pycrypto==2.6
pyflakes==0.7.3
pyparsing==1.5.7
python-cinderclient==1.0.4
python-glanceclient==0.9.0
python-keystoneclient==0.3.1
python-memcached==1.53
python-novaclient==2.13.0
python-quantumclient==2.2.3
python-swiftclient==1.5.0
pytz==2013b
requests==1.2.3
simplejson==3.3.0
six==1.3.0
sqlalchemy-migrate==0.7.2
termcolor==1.1.0
warlock==1.0.1
wsgiref==0.1.2
+ echo ======================================================================
======================================================================
+ '[' -d .testrepository ']'
+ sudo /usr/local/jenkins/slave_scripts/jenkins-sudo-grep.sh post
+ sudoresult=0
+ '[' 0 -ne 0 ']'
+ /usr/local/jenkins/slave_scripts/jenkins-oom-grep.sh post
+ oomresult=0
+ '[' 0 -ne 0 ']'
++ find . -name nose_results.html
+ htmlreport=
+ '[' -f '' ']'
+ echo
+ echo 'WARNING: Unable to find to confirm results!'
WARNING: Unable to find to confirm results!
+ echo
+ exit 1
+ rm -rf /tmp/tmp.DQxkiktKLr
Build step 'Execute shell' marked build as failure
[SCP] Connecting to static.openstack.org
[SCP] No file(s) found: **/*nose_results.html
[SCP] '**/*nose_results.html' doesn't match anything: '**' exists but not '**/*nose_results.html'
[SCP] Connecting to static.openstack.org
[SCP] Trying to create /srv/static/logs/periodic/periodic-heat-python27-stable-grizzly/precise13/121
[SCP] Copying console log.
1
1
Build failed in Jenkins: periodic-tempest-devstack-vm-neutron-stable-grizzly #33
by OpenStack Jenkins 05 Aug '13
by OpenStack Jenkins 05 Aug '13
05 Aug '13
See <https://jenkins.openstack.org/job/periodic-tempest-devstack-vm-neutron-stab…>
------------------------------------------
Started by user anonymous
[EnvInject] - Loading node environment variables.
Building remotely on devstack-precise-hpcloud-az1-182670 in workspace <https://jenkins.openstack.org/job/periodic-tempest-devstack-vm-neutron-stab…>
Waiting for the completion of devstack-update-inprogress
devstack-update-inprogress #213153 completed. Result was SUCCESS
Build step 'Trigger/call builds on other projects' changed build result to SUCCESS
[periodic-tempest-devstack-vm-neutron-stable-grizzly] $ /bin/bash -xe /tmp/hudson478854661911155925.sh
+ [[ ! -e devstack-gate ]]
+ git clone https://review.openstack.org/p/openstack-infra/devstack-gate
Cloning into 'devstack-gate'...
[periodic-tempest-devstack-vm-neutron-stable-grizzly] $ /bin/bash -xe /tmp/hudson7355411480065243880.sh
+ export PYTHONUNBUFFERED=true
+ PYTHONUNBUFFERED=true
+ export DEVSTACK_GATE_TEMPEST=1
+ DEVSTACK_GATE_TEMPEST=1
+ export DEVSTACK_GATE_NEUTRON=1
+ DEVSTACK_GATE_NEUTRON=1
+ cp devstack-gate/devstack-vm-gate-wrap.sh ./safe-devstack-vm-gate-wrap.sh
+ ./safe-devstack-vm-gate-wrap.sh
Build step 'Execute shell' marked build as failure
[SCP] Connecting to static.openstack.org
[SCP] Trying to create /srv/static/logs/periodic/periodic-tempest-devstack-vm-neutron-stable-grizzly/devstack-precise-hpcloud-az1-182670
[SCP] Trying to create /srv/static/logs/periodic/periodic-tempest-devstack-vm-neutron-stable-grizzly/devstack-precise-hpcloud-az1-182670/33
[SCP] Trying to create /srv/static/logs/periodic/periodic-tempest-devstack-vm-neutron-stable-grizzly/devstack-precise-hpcloud-az1-182670/33/logs
[SCP] uploading file: '/srv/static/logs/periodic/periodic-tempest-devstack-vm-neutron-stable-grizzly/devstack-precise-hpcloud-az1-182670/33/logs/devstack-gate-setup-workspace-new.txt'
[SCP] No file(s) found: **/testr_results.html.gz
[SCP] '**/testr_results.html.gz' doesn't match anything: '**' exists but not '**/testr_results.html.gz'
[SCP] No file(s) found: **/subunit_log.txt.gz
[SCP] '**/subunit_log.txt.gz' doesn't match anything: '**' exists but not '**/subunit_log.txt.gz'
[SCP] Connecting to static.openstack.org
[SCP] Copying console log.
1
1
Build failed in Jenkins: periodic-tempest-devstack-vm-cinder-stable-folsom #311
by OpenStack Jenkins 05 Aug '13
by OpenStack Jenkins 05 Aug '13
05 Aug '13
See <https://jenkins.openstack.org/job/periodic-tempest-devstack-vm-cinder-stabl…>
------------------------------------------
Started by user anonymous
[EnvInject] - Loading node environment variables.
Building remotely on devstack-precise-hpcloud-az2-182649 in workspace <https://jenkins.openstack.org/job/periodic-tempest-devstack-vm-cinder-stabl…>
Waiting for the completion of devstack-update-inprogress
devstack-update-inprogress #213149 completed. Result was SUCCESS
Build step 'Trigger/call builds on other projects' changed build result to SUCCESS
[periodic-tempest-devstack-vm-cinder-stable-folsom] $ /bin/bash -xe /tmp/hudson8060078738614211233.sh
+ [[ ! -e devstack-gate ]]
+ git clone https://review.openstack.org/p/openstack-infra/devstack-gate
Cloning into 'devstack-gate'...
[periodic-tempest-devstack-vm-cinder-stable-folsom] $ /bin/bash -xe /tmp/hudson6035837681319392940.sh
+ export PYTHONUNBUFFERED=true
+ PYTHONUNBUFFERED=true
+ export DEVSTACK_GATE_TEMPEST=1
+ DEVSTACK_GATE_TEMPEST=1
+ export DEVSTACK_GATE_CINDER=1
+ DEVSTACK_GATE_CINDER=1
+ cp devstack-gate/devstack-vm-gate-wrap.sh ./safe-devstack-vm-gate-wrap.sh
+ ./safe-devstack-vm-gate-wrap.sh
Build step 'Execute shell' marked build as failure
[SCP] Connecting to static.openstack.org
[SCP] Trying to create /srv/static/logs/periodic/periodic-tempest-devstack-vm-cinder-stable-folsom/devstack-precise-hpcloud-az2-182649
[SCP] Trying to create /srv/static/logs/periodic/periodic-tempest-devstack-vm-cinder-stable-folsom/devstack-precise-hpcloud-az2-182649/311
[SCP] Trying to create /srv/static/logs/periodic/periodic-tempest-devstack-vm-cinder-stable-folsom/devstack-precise-hpcloud-az2-182649/311/logs
[SCP] uploading file: '/srv/static/logs/periodic/periodic-tempest-devstack-vm-cinder-stable-folsom/devstack-precise-hpcloud-az2-182649/311/logs/devstack-gate-setup-workspace-new.txt'
[SCP] No file(s) found: **/testr_results.html.gz
[SCP] '**/testr_results.html.gz' doesn't match anything: '**' exists but not '**/testr_results.html.gz'
[SCP] No file(s) found: **/subunit_log.txt.gz
[SCP] '**/subunit_log.txt.gz' doesn't match anything: '**' exists but not '**/subunit_log.txt.gz'
[SCP] Connecting to static.openstack.org
[SCP] Copying console log.
1
1