[openstack-dev] [Neutron][qa] Intermittent failure of tempest test test_network_basic_ops

Sukhdev Kapur sukhdevkapur at gmail.com
Thu Jan 9 02:46:37 UTC 2014

Dear fellow developers,

I am running few Neutron tempest tests and noticing an intermittent failure
of tempest.scenario.test_network_basic_ops.

I ran this test 50+ times and am getting intermittent failure. The pass
rate is apps. 70%. The 30% of the time it fails mostly in

Has anybody seen this?
If there is a fix or work around for this, please share your wisdom.


Here is the Traceback:

Traceback (most recent call last):
  File "tempest/scenario/test_network_basic_ops.py", line 300, in
  File "tempest/scenario/test_network_basic_ops.py", line 269, in
    raise exc
AssertionError: Timed out waiting for to become reachable
FAIL: process-returncode
tags: worker-0
Binary content:
  traceback (test/plain; charset="utf8")
Ran 2 tests in 185.446s (-142.730s)
FAILED (id=38, failures=2)

Full Log of tempest.log is here :

-------------- next part --------------
An HTML attachment was scrubbed...
URL: <http://lists.openstack.org/pipermail/openstack-dev/attachments/20140108/6a36ed5b/attachment.html>

More information about the OpenStack-dev mailing list